program: Gaussian 09
title: 000234807
version: EM64L-G09RevD.01
frameworkgroup: C1[X(C6H12OS)]
method: RPBEPBE
basis: SDD
operation: Freq
keyword: #p
keyword: freq=noraman
keyword: PBEPBE/SDD
title: #p freq=noraman PBEPBE/SDD
converged: YES YES NO NO
title: Mulliken charges:
elementType: S O C C C C C C H H H H H H H H H H H H
charge: 0.147760 -0.234474 -0.352788 -0.316318 -0.344546 -0.662507 -0.248097 -0.691715 0.251821 0.199073 0.223620 0.229129 0.187693 0.271541 0.254886 0.208238 0.237251 0.214254 0.207296 0.217883
chargesum: 0.00000
title: Mulliken charges with hydrogens summed into heavy atoms:
elementType: S O C C C C C C
charge: 0.147760 -0.234474 -0.100967 0.106375 0.072276 -0.136079 0.197392 -0.052282
polarizability: 1.04994053e+02 -1.81939949e+00 8.08482782e+01 -4.76979991e+00 9.64782259e-01 6.42077640e+01
1716.lowfreq: -14.0462 -7.0905 -0.0028 0.0022 0.0022 9.6076 60.3757 81.4816 95.9858
frequency: 60.2264 81.4166 95.9274 140.9402 233.3956 251.8370 287.6769 311.7695 451.9068 476.9401 535.2552 653.5093 701.5879 735.3502 799.7262 866.1604 890.8134 907.3985 933.9994 996.1411 1023.1332 1044.7758 1074.3030 1106.5715 1138.3163 1147.4343 1184.4342 1203.3125 1239.1982 1266.0462 1282.0519 1290.7409 1326.9498 1347.2042 1357.4242 1388.9411 1447.2700 1449.4312 1462.3831 1475.0965 1478.0378 1486.3155 2968.5434 2973.0813 2977.1659 2983.9776 2993.6201 3034.2120 3043.0786 3059.7545 3074.1791 3076.7048 3090.0371 3122.5598
redmass: 2.7910 1.8803 2.9397 3.3799 1.1234 2.3088 4.1083 2.9311 6.2245 3.1201 3.7227 3.7258 4.8524 1.2096 1.9487 1.7159 1.6777 1.6768 2.3458 2.4151 1.8375 2.8012 1.7802 2.0998 2.0444 1.5098 1.1841 1.3407 1.2966 1.1839 1.2574 1.1200 1.2546 1.3264 1.4883 1.2128 1.0885 1.0856 1.0931 1.0501 1.0438 1.0810 1.0667 1.0363 1.0645 1.0841 1.0622 1.0952 1.0567 1.1011 1.0991 1.1019 1.0978 1.1101
irintensity: 2.0012 0.6532 2.4457 1.5199 0.0415 6.6400 2.3495 3.0941 1.6032 7.9363 1.1266 2.3677 32.6742 7.0022 27.2128 5.9448 5.7988 7.2172 14.0315 24.2681 9.6639 12.6827 8.7472 16.6019 8.7344 11.7807 15.4915 13.7137 1.5874 19.7364 2.8294 0.3311 7.7958 0.3705 13.0784 7.8464 2.8590 11.4739 3.1424 3.6518 11.8443 14.5668 65.9691 40.2177 7.8395 55.1501 23.1894 2.2573 27.9497 2.2810 49.2589 92.3597 21.3513 20.0058
temp: 298.150 k
press: 1.00000 atm
elementType: 16 8 6 6 6 6 6 6 1 1 1 1 1 1 1 1 1 1 1 1
symmnumber: 1
zpe: 448768.7 jmol-1
zpe.correction: 0.170927 hartree
zpe.thermalcorrener: 0.180275 hartree
zpe.thermalcorrenthalpy: 0.181219 hartree
zpe.thermalcorrgfe: 0.135810 hartree
zpe.sumelectzpe: -708.444600 hartree
zpe.sumelectthermal: -708.435252 hartree
zpe.sumelectthermalent: -708.434308 hartree
zpe.sumelectthermalfe: -708.479718 hartree
dipole: -0.6178 1.2417 -0.4726
dipole: 1.4653
quadrupole: -51.0919 -60.5720 -56.7580
quadrupole: -5.8363 -1.4487 -0.1797
quadrupole: 5.0487 -4.4314 -0.6173 -5.8363 -1.4487 -0.1797
hfenergy: -708.6155273 hartree
pointgroup: C01 [X(C6H12O1S1)]
dipole: 0.2765335 0.4741906 0.1760558 debye
dipolederiv: -0.4282617 0.1295342 0.0518415 0.1029127 -0.2557004 -0.0248644 0.0725619 -0.0427047 -0.2147381 -0.77433 -0.0996182 0.0248143 -0.0701979 -0.7732617 -0.0096952 0.0823797 0.0316792 -0.3849804 0.7526951 -0.1010654 -0.1075997 -0.0813279 0.6831087 0.0580587 -0.1232884 -0.0123862 0.427559 -0.1390098 -0.0288186 -0.0342082 0.1006344 0.0346401 -0.048065 0.0038671 -0.0709054 0.059593 0.0215876 0.0154269 -0.0240553 -0.0867881 0.0903588 -0.0198063 -0.0977074 -0.0166392 0.1652186 0.111831 0.0958617 -0.0295335 0.2225421 -0.0616803 -0.1247392 -0.0808481 -0.1284474 0.1398583 0.4926833 0.0584008 0.0624658 -0.0392765 0.3203996 0.0270163 0.076951 0.1550871 0.360207 -0.0659285 -0.0038669 -0.037723 0.0540071 0.0744878 -0.0217974 -0.007397 -0.0233508 0.0729615 -0.0538873 0.0353993 0.0239651 -0.0026135 -0.0383883 -0.0646343 0.0540651 -0.0080884 -0.1787655 0.0365877 -0.0332322 0.0177589 -0.036911 -0.1052808 0.0566978 0.0166767 0.0796286 0.0567455 0.0590613 0.0135308 0.0209444 0.0249945 0.075047 -0.0052864 0.0030056 -0.0307854 -0.121993 0.049235 -0.0659754 0.0124297 -0.0406448 -0.1119611 0.0414336 0.007158 0.0654045 0.0615904 0.0366357 0.0082438 -0.020119 0.0093879 0.0690241 -0.0080702 0.0097823 -0.0434101 -0.2067554 0.0431426 -0.0304387 0.0233754 -0.0643456 0.0098288 0.0460045 0.0773132 0.0173877 -0.1342305 -0.1401714 0.0024124 -0.0349944 -0.0255925 0.0895226 0.0227835 -0.0453422 0.0100182 0.0690915 -0.0396271 -0.0356884 -0.0254161 0.0187592 0.0549449 -0.0061141 -0.1089007 -0.0990359 -0.1760973 0.0485764 -0.0262442 0.0119091 -0.0950068 -0.0875736 0.0689079 0.0342404 0.0911201 0.052538 0.0732327 -0.0068561 0.0367467 -0.0223617 0.0893258 -0.014756 -0.0324864 -0.0149853 -0.1821926 0.0509713 -0.0460297 -0.0027506 -0.117828 -0.1371225 0.0707107 0.0183091 0.0886008 0.0539647 -0.1350239 0.1190239 0.0301489 0.1496564 -0.0197194 -0.0437845 0.0396601 -0.0481874 0.0804254 unknown
polarizability: 105.0361802|0.1238781|80.6896757|-5.2020236|-0.9035443|64.3242395 unknown
InChI: InChI=1S/C6H12OS/c1-2-3-6-7-4-5-8-6/h6H,2-5H2,1H3
charge 0 multiplicity 1
20 atoms
S  1.551701 -1.56825 0.055665
O  0.633784 1.00391 -0.149574
C  0.176425 -0.235677 0.457531
C  -1.183645 -0.614795 -0.114917
C  -2.292207 0.39932 0.260296
C  2.71481 -0.189889 -0.531535
C  2.091039 1.111243 0.016751
C  -3.661164 0.007066 -0.334476
H  0.168947 -0.145289 1.562475
H  -1.459498 -1.620073 0.260905
H  -1.087985 -0.693028 -1.213913
H  -1.995811 1.403061 -0.097143
H  -2.371357 0.466039 1.364738
H  2.746124 -0.195522 -1.631685
H  3.718965 -0.369653 -0.115969
H  2.348395 1.238648 1.089262
H  2.398288 2.003556 -0.551922
H  -3.616531 -0.032488 -1.43897
H  -3.983271 -0.98899 0.024231
H  -4.443504 0.735808 -0.054151
