program: Gaussian 09
title: 000234799
version: EM64L-G09RevD.01
frameworkgroup: C1[X(C16H31N)]
method: RPBEPBE
basis: SDD
operation: Freq
keyword: #pfreq=noraman
keyword: PBEPBE/SDD
title: #p freq=noraman PBEPBE/SDD
converged: NO YES NO NO
title: Mulliken charges:
elementType: N C C C C C C C C C C C C C C C C H H H H H H H H H H H H H H H H H H H H H H H H H H H H H H H
charge: -0.289219 -0.038698 -0.038980 -0.033103 -0.025461 -0.427409 -0.434655 -0.438851 -0.444588 -0.424600 -0.431270 -0.402505 -0.399630 -0.396477 -0.398281 -0.761464 -0.767338 0.168253 0.180744 0.189516 0.182331 0.232875 0.179332 0.184437 0.220348 0.197954 0.199908 0.207216 0.189653 0.190496 0.187381 0.190939 0.187969 0.187703 0.197448 0.186121 0.196508 0.189285 0.195092 0.191416 0.195786 0.240650 0.207185 0.216237 0.212254 0.212288 0.222619 0.212586
chargesum: 0.00000
title: Mulliken charges with hydrogens summed into heavy atoms:
elementType: N C C C C C C C C C C C C C C C C
charge: -0.048570 0.129555 0.141763 0.156413 0.156870 -0.015202 -0.029871 -0.040989 -0.047718 -0.046723 -0.052362 -0.017354 -0.017001 -0.012100 -0.011079 -0.125788 -0.119845
polarizability: 2.02046906e+02 3.40377349e+00 1.72569773e+02 5.11820381e-01 -6.79982245e-01 1.50377992e+02
1716.lowfreq: -21.6273 -0.0006 -0.0005 0.0001 4.5044 12.4831 20.8420 38.5821 49.7284
frequency: -7.5680 35.4967 47.4938 83.6756 85.2929 105.0426 127.0384 146.0260 177.4056 183.7859 196.3954 206.2814 248.9720 307.1089 311.4058 315.5583 318.6093 343.2921 353.5478 366.5142 403.0861 419.5066 426.4913 440.8529 447.2817 508.4480 523.8835 545.3420 638.3825 670.3782 753.9586 766.5482 815.3700 821.6391 822.8558 832.4754 853.8609 865.8546 875.2586 883.4126 921.0975 930.2873 936.3882 943.7597 962.6172 966.3365 991.3054 1001.2172 1009.5156 1048.8731 1056.4496 1058.7907 1067.9625 1073.4242 1084.7562 1087.0102 1099.3323 1113.6558 1116.4523 1133.3027 1138.1857 1151.5145 1164.3258 1172.5767 1202.9407 1211.8660 1217.3996 1235.8546 1245.0078 1245.9899 1252.6617 1262.8518 1279.6602 1292.8998 1294.7913 1295.6959 1299.3641 1305.0653 1324.1350 1328.9550 1332.2983 1338.8005 1339.2776 1340.8003 1342.3250 1343.7360 1344.0901 1349.9816 1359.6862 1381.9217 1386.8061 1390.9762 1446.0672 1457.2894 1460.7057 1463.5724 1464.3413 1467.0150 1469.3783 1470.0394 1473.0483 1474.1787 1475.2605 1478.0586 1481.7627 1485.3417 1497.6116 2848.4961 2874.7414 2908.9381 2923.6945 2937.0368 2940.1146 2951.5869 2954.0946 2954.2966 2960.0599 2962.2666 2964.1357 2964.3204 2967.4337 2967.7811 2975.0609 2984.5691 2986.5210 3015.0666 3015.5017 3021.6025 3022.0443 3028.0874 3032.6257 3040.7540 3047.6435 3056.0118 3058.2754 3066.3290 3073.7240 3415.4845
redmass: 3.0803 3.5872 3.2818 2.6517 3.2759 2.2350 2.5969 2.7307 1.7017 1.9245 1.1972 1.4930 3.1184 1.9989 2.1698 1.7714 1.7295 2.0535 2.3924 2.3738 3.1648 3.3153 2.8864 2.8510 2.8030 2.4345 1.8723 1.8209 2.9541 1.3712 1.9885 2.1887 1.5364 1.6484 2.0432 1.9173 2.2963 2.1340 1.4679 1.4731 1.9419 2.0793 1.6255 1.6167 1.2633 1.2781 1.7576 1.6210 1.5665 3.0578 1.4684 1.2901 2.3795 1.5945 1.6670 1.8155 1.8016 2.2626 2.4817 1.8609 2.8765 2.2177 1.9562 2.2214 1.5557 1.4917 1.4827 1.2866 1.3426 1.3081 1.3230 1.2299 1.2742 1.2981 1.2855 1.3044 1.2403 1.2230 1.3766 1.4208 1.3739 1.4626 1.5216 1.5313 1.6137 1.5017 1.5120 1.5057 1.4878 1.3727 1.2155 1.2227 1.1803 1.0879 1.0881 1.0863 1.0865 1.0828 1.0839 1.0685 1.0716 1.0867 1.0823 1.0679 1.0645 1.0570 1.0724 1.0712 1.0686 1.0795 1.0803 1.0800 1.0822 1.0638 1.0633 1.0698 1.0617 1.0594 1.0645 1.0633 1.0373 1.0382 1.0628 1.0890 1.0857 1.0988 1.0980 1.0953 1.0966 1.1029 1.1021 1.1022 1.0956 1.0983 1.0990 1.0986 1.0980 1.0731
irintensity: 0.0417 0.1445 0.0361 0.0946 1.1286 1.9174 1.0462 0.5400 0.1241 0.1755 0.2111 0.0292 0.7465 0.4580 0.4581 0.2345 0.6563 0.6566 0.9270 0.0445 0.6166 0.1683 0.4134 0.1143 0.8658 0.1162 0.4755 1.3318 0.2029 66.8554 2.5565 0.0794 1.9440 2.3036 0.1467 0.5638 3.3337 4.4376 5.6955 7.4808 1.7498 2.0876 5.5110 4.5570 4.3214 7.0126 0.8190 14.5131 12.4745 0.9016 8.6939 0.1084 0.9007 2.3866 8.9040 3.3671 6.0014 0.2919 1.5662 3.4273 53.6684 1.2364 1.9842 4.0671 0.2594 1.0315 3.0609 3.2634 1.2770 2.2705 2.0523 4.1792 2.4020 0.3594 1.6152 2.0669 1.3008 2.3205 0.8792 1.4385 1.6301 1.1187 0.2343 0.1003 1.8578 0.2945 5.9937 1.6374 5.9866 8.7962 7.2995 17.9739 50.2117 4.8158 5.2688 14.0134 7.3885 14.7396 9.1139 9.6505 12.4475 1.9214 12.9552 5.6201 7.8332 13.6906 11.9075 82.9564 116.2834 9.1207 0.4826 9.0478 43.6168 6.6510 66.4764 55.5410 43.6996 40.8412 31.5265 48.1135 21.1042 65.8335 24.1297 4.9490 101.2232 62.1680 60.2498 46.1332 88.1709 29.9816 79.2422 93.0739 37.4896 72.5267 57.7083 53.5641 46.2292 2.2998
temp: 298.150 k
press: 1.00000 atm
elementType: 7 6 6 6 6 6 6 6 6 6 6 6 6 6 6 6 6 1 1 1 1 1 1 1 1 1 1 1 1 1 1 1 1 1 1 1 1 1 1 1 1 1 1 1 1 1 1 1
symmnumber: 1
zpe: 1160561.7 jmol-1
zpe.correction: 0.442035 hartree
zpe.thermalcorrener: 0.459805 hartree
zpe.thermalcorrenthalpy: 0.460749 hartree
zpe.thermalcorrgfe: 0.396967 hartree
zpe.sumelectzpe: -681.649652 hartree
zpe.sumelectthermal: -681.631881 hartree
zpe.sumelectthermalent: -681.630937 hartree
zpe.sumelectthermalfe: -681.694719 hartree
dipole: -0.1192 0.7618 -0.1928
dipole: 0.7948
quadrupole: -108.4276 -111.2487 -107.2812
quadrupole: -0.4621 0.2880 0.3729
quadrupole: 0.5582 -2.2628 1.7046 -0.4621 0.2880 0.3729
hfenergy: -682.0916864 hartree
pointgroup: C01 [X(C16H31N1)]
dipole: -0.0498444 -0.2944345 0.0927545 debye
polarizability: 201.9780393|-3.7129149|172.4899025|-0.2978284|-1.9364105|150.5267293 unknown
InChI: InChI=1S/C16H31N/c1-13-7-3-5-9-15(13)11-17-12-16-10-6-4-8-14(16)2/h13-17H,3-12H2,1-2H3
charge 0 multiplicity 1
48 atoms
N  -0.179359 -0.354211 -0.418306
C  2.277037 -0.177183 0.017988
C  -2.678483 -0.373314 -0.764276
C  3.682001 -0.821527 -0.197475
C  -3.011653 -0.708053 0.72432
C  2.316802 1.345343 -0.281601
C  -2.818392 1.149593 -1.032761
C  1.159228 -0.854803 -0.812196
C  -1.295447 -0.903196 -1.221613
C  4.753738 -0.057138 0.629805
C  -4.417737 -0.161933 1.09437
C  3.381026 2.084213 0.557264
C  -4.213219 1.688517 -0.640908
C  4.778191 1.460281 0.33864
C  -4.547331 1.355079 0.831145
C  3.729793 -2.327077 0.159681
C  -2.920562 -2.219178 1.03855
H  2.025431 -0.308389 1.097685
H  -3.436062 -0.90088 -1.388172
H  3.940864 -0.706841 -1.2743
H  -2.281669 -0.167275 1.368281
H  1.308771 1.767899 -0.117977
H  2.547271 1.482641 -1.360517
H  -2.622117 1.349414 -2.10534
H  -2.030529 1.683238 -0.465821
H  1.227214 -1.966387 -0.719331
H  1.309277 -0.616443 -1.885709
H  -1.132077 -0.598214 -2.275379
H  -1.307009 -2.023301 -1.220342
H  5.750301 -0.500648 0.432803
H  4.543568 -0.216582 1.709524
H  -4.630912 -0.385846 2.158982
H  -5.180248 -0.705155 0.495712
H  3.115278 2.01894 1.633244
H  3.393759 3.160585 0.29604
H  -4.982786 1.231598 -1.298219
H  -4.258907 2.782649 -0.80768
H  5.089484 1.627104 -0.713644
H  5.532458 1.958246 0.979232
H  -3.849317 1.903288 1.497494
H  -5.569221 1.701219 1.08216
H  -0.335298 -0.513631 0.588058
H  3.36977 -2.4947 1.194081
H  3.114358 -2.945651 -0.517029
H  4.767969 -2.705502 0.102659
H  -3.601873 -2.797398 0.384656
H  -1.900186 -2.619037 0.896408
H  -3.214298 -2.416554 2.086912
