program: Gaussian 09
title: 000234796
version: EM64L-G09RevD.01
frameworkgroup: C1[X(C7H13NO3S3)]
method: RPBEPBE
basis: SDD
operation: Freq
keyword: #p
keyword: freq=noraman
keyword: PBEPBE/SDD
title: #p freq=noraman PBEPBE/SDD
converged: YES YES NO NO
title: Mulliken charges:
elementType: S S S O O O N C C C C C C C H H H H H H H H H H H H H
charge: 0.957301 0.246538 0.007205 -0.435025 -0.570934 -0.539354 0.008787 -0.538853 0.009949 -0.534930 -0.592923 -0.426002 -0.606008 -0.616502 0.316080 0.246252 0.306081 0.290416 0.294400 0.304461 0.339183 0.273616 0.267324 0.228985 0.246144 0.264428 0.253380
chargesum: 0.00000
title: Mulliken charges with hydrogens summed into heavy atoms:
elementType: S S S O O O N C C C C C C C
charge: 0.957301 0.246538 0.007205 -0.095842 -0.570934 -0.539354 0.008787 -0.222774 0.256201 0.061567 0.005938 -0.426002 0.163917 0.147450
polarizability: 2.17985016e+02 -8.54421463e+00 1.46986861e+02 -7.44650608e+00 -9.08280358e+00 1.17261813e+02
1716.lowfreq: -10.0456 -7.2922 -2.6140 -0.0028 -0.0023 -0.0018 23.7534 41.0821 64.6945
frequency: 23.6480 40.9814 64.6445 65.9333 85.9083 109.8959 119.7831 127.8066 180.6634 190.2662 201.4795 226.8435 253.2785 258.8023 271.7561 306.4030 311.5813 386.2437 392.4068 404.7316 436.8134 478.1052 517.5313 531.8070 536.0953 557.6548 572.3764 612.1085 768.0437 798.3576 832.1856 848.1104 861.8576 873.1316 935.4333 949.0336 973.0780 995.9771 1047.0287 1058.7616 1084.3198 1088.7234 1128.7634 1138.2331 1148.6371 1165.9258 1182.6468 1222.7509 1239.1040 1259.3979 1291.1752 1316.5667 1369.8733 1382.6959 1396.1024 1415.1074 1428.7233 1450.5357 1459.7151 1475.9235 1479.3199 1505.2117 2961.5095 2986.4804 2994.5743 3002.4797 3071.7725 3077.2041 3078.5204 3085.3362 3116.4469 3121.6280 3180.4771 3184.6753 3202.1831
redmass: 5.0313 7.1234 1.9680 3.2307 4.1689 2.3936 1.2935 7.1834 6.7289 5.9029 4.3145 4.8565 4.2007 3.6339 5.3003 3.5828 6.3625 5.4694 4.2522 6.0199 3.3467 2.9732 2.4498 7.2807 4.2477 1.8928 5.6456 3.2523 5.1373 10.4760 2.4394 4.9823 2.8792 2.1750 2.6662 4.7005 2.3458 2.1636 1.6115 1.8526 1.2285 1.4465 1.4018 1.6572 1.4405 1.5003 1.3951 3.3043 1.2678 1.1409 1.1882 1.2663 1.4595 2.0849 1.1155 1.1119 1.1266 1.0431 1.1464 1.0443 1.0539 1.5108 1.0850 1.0356 1.0346 1.0836 1.0553 1.0997 1.0548 1.1001 1.1021 1.1007 1.1129 1.1129 1.0699
irintensity: 1.8486 1.9830 2.0475 2.9663 0.6453 0.7467 1.0918 3.0494 2.9990 5.2261 0.7274 11.0017 7.5237 8.6588 10.6845 8.3152 8.4604 10.2330 15.5041 28.7139 4.5319 10.3032 39.4646 3.3508 2.6942 100.0918 2.2482 5.8325 46.3886 98.0909 8.8428 9.6058 3.7304 13.5939 19.4920 65.7273 50.1918 39.8033 21.0216 11.3525 4.9241 36.5005 4.1401 88.0915 8.0106 5.0013 8.0443 27.7714 16.6742 1.5488 11.6128 20.1580 31.0852 84.0149 15.8541 10.4278 19.0959 25.2119 2.8876 9.0641 11.9196 160.1968 36.2324 30.5654 47.0973 1.8726 4.0345 18.6053 6.0508 10.6857 9.3169 14.7401 2.3282 6.0187 521.4572
temp: 298.150 k
press: 1.00000 atm
elementType: 16 16 16 8 8 8 7 6 6 6 6 6 6 6 1 1 1 1 1 1 1 1 1 1 1 1 1
symmnumber: 1
zpe: 525754.5 jmol-1
zpe.correction: 0.200249 hartree
zpe.thermalcorrener: 0.217294 hartree
zpe.thermalcorrenthalpy: 0.218238 hartree
zpe.thermalcorrgfe: 0.154039 hartree
zpe.sumelectzpe: -1747.858882 hartree
zpe.sumelectthermal: -1747.841838 hartree
zpe.sumelectthermalent: -1747.840893 hartree
zpe.sumelectthermalfe: -1747.905092 hartree
dipole: 9.5195 -3.6210 2.0954
dipole: 10.3983
quadrupole: -103.2631 -116.2444 -108.4935
quadrupole: -6.5404 -20.1216 -1.8865
quadrupole: 6.0706 -6.9108 0.8402 -6.5404 -20.1216 -1.8865
hfenergy: -1748.0591313 hartree
pointgroup: C01 [X(C7H13N1O3S3)]
dipole: -3.636263 0.2183986 -1.8617455 debye
polarizability: 216.8574696|10.7083844|115.2177894|9.5440758|4.0906515|150.1584311 unknown
InChI: InChI=1S/C7H13NO3S3/c1-8(2)7(12)13-6-4-14(10,11)3-5(6)9/h5-6,9H,3-4H2,1-2H3
charge 0 multiplicity 1
27 atoms
S  3.217819 -0.728436 0.099269
S  -0.859676 0.357177 -1.626441
S  -1.59628 0.363947 1.439805
O  1.152188 1.826125 0.863707
O  3.924311 -1.452276 -1.193117
O  3.725786 -1.033487 1.615883
N  -3.181034 -0.55087 -0.564698
C  0.95559 0.172229 -1.039967
C  1.606743 1.471931 -0.465057
C  1.267125 -0.998687 -0.12223
C  3.110858 1.192742 -0.324689
C  -1.978312 -0.012296 -0.192228
C  -4.248418 -0.700508 0.455371
C  -3.527106 -1.015247 -1.929011
H  1.416636 -0.020645 -2.030261
H  1.442094 2.302703 -1.183817
H  0.834781 -0.931695 0.884825
H  1.186953 -1.99191 -0.582848
H  3.701275 1.29628 -1.246024
H  3.533988 1.716646 0.542357
H  0.192611 1.554764 1.015945
H  -4.296592 0.203028 1.085327
H  -4.037948 -1.560695 1.11647
H  -5.210569 -0.850931 -0.059217
H  -4.105865 -1.951046 -1.850889
H  -2.614661 -1.210075 -2.51161
H  -4.136496 -0.260964 -2.461154
