program: Gaussian 09
title: 000234793
version: EM64L-G09RevD.01
frameworkgroup: C1[X(C12H15NO2)]
method: RPBEPBE
basis: SDD
operation: Freq
keyword: #p
keyword: freq=noraman
keyword: PBEPBE/SDD
title: #p freq=noraman PBEPBE/SDD
converged: YES YES NO NO
title: Mulliken charges:
elementType: O O N C C C C C C C C C C C C H H H H H H H H H H H H H H H
charge: -0.308478 -0.320388 -0.142969 0.481830 -0.385060 -0.287289 -0.176171 -0.390839 -0.396852 0.359283 -0.610635 -0.618420 -0.231612 -0.233742 -0.241631 0.239045 0.215489 0.241621 0.224900 0.224026 0.234370 0.223218 0.221696 0.276472 0.221901 0.220645 0.278652 0.224700 0.227139 0.229099
chargesum: 0.00000
title: Mulliken charges with hydrogens summed into heavy atoms:
elementType: O O N C C C C C C C C C C C C
charge: -0.308478 -0.320388 -0.142969 0.481830 0.069474 -0.045668 0.048729 -0.166813 -0.162482 0.359283 0.110751 0.102779 -0.006912 -0.006603 -0.012532
polarizability: 2.09434017e+02 2.47035167e+01 1.27909880e+02 8.00178971e+00 -1.40460539e+01 1.15641547e+02
1716.lowfreq: -14.2753 -3.2798 0.0005 0.0007 0.0007 7.2853 21.7294 28.3989 37.3861
frequency: 21.6514 28.3440 37.1897 83.3963 95.6964 113.2685 120.7981 126.5386 140.1992 207.7288 241.0692 264.6749 304.4832 334.7301 371.3422 392.8132 404.0138 443.9834 490.2467 556.4401 577.5501 609.5585 615.3857 690.8419 697.3055 751.0089 766.5563 815.4974 843.3249 853.6477 897.5882 924.0342 962.1692 977.4418 984.9112 989.4447 998.4313 999.4485 1027.3586 1058.1097 1078.3229 1098.8712 1113.9611 1135.8537 1149.1893 1172.2736 1190.8593 1222.5510 1234.1695 1251.3107 1296.1582 1309.3209 1335.8491 1346.6669 1380.9058 1387.2130 1418.7523 1433.7334 1439.5538 1452.9355 1472.5494 1477.6505 1485.3867 1486.9392 1500.1303 1584.1599 1611.7308 1646.1745 1662.7960 2960.8427 2967.3610 3029.2154 3030.3714 3036.6612 3095.2192 3098.4976 3117.7126 3121.1600 3122.5952 3125.9517 3138.5186 3144.7400 3148.6288 3164.6358
redmass: 4.3157 4.0271 3.8676 3.9970 1.7545 1.7461 1.9244 1.7084 3.0636 3.5934 2.6147 2.9577 3.2398 5.0003 2.7806 2.9512 2.7835 3.5892 3.3639 4.8922 4.3596 4.7412 6.4294 10.9414 1.7341 4.0950 1.9048 3.8389 1.7971 1.5696 3.7360 1.4951 2.0592 1.3634 1.2444 5.8472 2.9013 1.3665 2.1233 1.3644 1.7839 1.2203 2.6958 2.4296 1.3732 1.0620 1.1185 1.6080 1.4312 6.0285 1.2814 1.5255 1.2860 1.3638 2.8255 4.5520 1.1637 1.2117 2.0907 1.1425 1.0488 1.0437 2.2938 1.0458 1.1953 5.7737 5.9813 7.3759 5.9175 1.0377 1.0376 1.0584 1.1000 1.1017 1.0993 1.0945 1.0945 1.0853 1.0966 1.0871 1.0916 1.0949 1.0962 1.1016
irintensity: 0.5401 0.3416 2.9870 0.8344 2.4728 1.7395 0.2682 0.6720 0.1065 3.6625 6.6283 0.5736 1.3655 18.0037 12.8009 6.6230 0.1031 13.1179 12.8962 3.9081 3.6646 1.8145 0.0537 19.2625 41.9363 33.4599 39.9662 0.2413 22.2547 21.2443 112.0173 1.6667 12.6703 4.6043 40.0060 0.1034 44.0665 39.4210 4.6546 10.0777 16.7388 0.3056 116.5325 410.7648 3.9779 0.1482 0.5797 5.8843 2.7059 25.9290 2.5517 3.5873 11.7832 14.9424 125.3909 14.4224 32.7899 11.2112 10.0610 40.7292 20.8939 0.4539 15.8306 36.0985 27.6326 3.5507 2.0554 330.6952 35.4071 36.3568 138.9189 32.6217 66.0489 31.1974 2.5877 10.8438 22.8492 5.9438 2.2990 1.9714 10.8368 2.8618 45.9244 25.5485
temp: 298.150 k
press: 1.00000 atm
elementType: 8 8 7 6 6 6 6 6 6 6 6 6 6 6 6 1 1 1 1 1 1 1 1 1 1 1 1 1 1 1
symmnumber: 1
zpe: 642970.7 jmol-1
zpe.correction: 0.244895 hartree
zpe.thermalcorrener: 0.260395 hartree
zpe.thermalcorrenthalpy: 0.261339 hartree
zpe.thermalcorrgfe: 0.199562 hartree
zpe.sumelectzpe: -670.348445 hartree
zpe.sumelectthermal: -670.332944 hartree
zpe.sumelectthermalent: -670.332000 hartree
zpe.sumelectthermalfe: -670.393777 hartree
dipole: -0.7077 -0.5397 2.1075
dipole: 2.2877
quadrupole: -73.1777 -84.7300 -87.3025
quadrupole: 0.9969 -4.3155 -0.7583
quadrupole: 8.5591 -2.9933 -5.5658 0.9969 -4.3155 -0.7583
hfenergy: -670.5933393 hartree
pointgroup: C01 [X(C12H15N1O2)]
dipole: 0.249769 -0.8647175 -0.0014966 debye
polarizability: 204.8085697|-0.6830146|123.9413441|32.1989174|-16.1668291|124.2355302 unknown
InChI: InChI=1S/C12H15NO2/c1-13(2)12(14)15-10-6-9-11-7-4-3-5-8-11/h3-9H,10H2,1-2H3
charge 0 multiplicity 1
30 atoms
O  2.368701 -0.259018 1.528522
O  2.378959 1.337318 -0.205424
N  3.792145 -0.538435 -0.2690
C  -2.160971 0.245664 0.111104
C  1.19836 0.477108 2.121284
C  -0.873861 0.655393 0.705991
C  -0.102476 -0.052552 1.581124
C  -2.833246 -0.963103 0.455138
C  -2.767256 1.0984 -0.854506
C  2.817412 0.262398 0.292694
C  4.406389 -0.120768 -1.537586
C  4.281377 -1.785869 0.334573
C  -4.059316 -1.30385 -0.149383
C  -3.994916 0.758138 -1.461179
C  -4.647586 -0.446116 -1.111466
H  1.318523 1.552241 1.905084
H  1.314886 0.282758 3.200352
H  -0.494174 1.636752 0.38558
H  -0.392027 -1.059976 1.909158
H  -2.397614 -1.635779 1.202391
H  -2.262209 2.03202 -1.13156
H  4.249391 -0.891562 -2.316889
H  5.495682 0.035156 -1.411449
H  3.941655 0.821817 -1.862803
H  5.357059 -1.700366 0.586659
H  4.157407 -2.627692 -0.374526
H  3.716317 -2.001207 1.250545
H  -4.562412 -2.237018 0.128713
H  -4.441432 1.428966 -2.203619
H  -5.601873 -0.713814 -1.578526
