program: Gaussian 09
title: 000234789
version: EM64L-G09RevD.01
frameworkgroup: C1[X(C12H14ClNO2)]
method: RPBEPBE
basis: SDD
operation: Freq
keyword: #p
keyword: freq=noraman
keyword: PBEPBE/SDD
title: #p freq=noraman PBEPBE/SDD
converged: YES YES NO NO
title: Mulliken charges:
elementType: Cl O O N C C C C C C C C C C C C H H H H H H H H H H H H H H
charge: -0.078269 -0.300690 -0.300742 -0.143563 -0.021614 -0.021653 -0.492597 -0.492734 -0.359080 -0.359018 0.446293 -0.344048 -0.343987 -0.224556 -0.224677 -0.119509 0.263216 0.263299 0.229194 0.274538 0.229231 0.274573 0.226305 0.221261 0.226265 0.221208 0.227555 0.227561 0.248115 0.248124
chargesum: 0.00000
title: Mulliken charges with hydrogens summed into heavy atoms:
elementType: Cl O O N C C C C C C C C C C C C
charge: -0.078269 -0.300690 -0.300742 -0.143563 0.241602 0.241646 0.011135 0.011070 0.088486 0.088455 0.446293 -0.116493 -0.116427 0.023559 0.023447 -0.119509
polarizability: 2.29797419e+02 -5.78752748e-04 1.40890045e+02 -2.66394046e-03 -1.72564797e+01 9.15110911e+01
1716.lowfreq: -9.5786 -5.3473 -0.8790 -0.0030 -0.0021 -0.0012 33.1595 37.7676 57.5196
frequency: 33.1504 37.7610 57.5069 58.5331 80.3754 87.2554 102.4001 181.1354 186.5578 241.9182 261.3786 281.4977 321.4954 354.2847 364.0777 382.6839 416.1470 444.9517 489.9936 501.0508 592.3982 610.4715 628.9045 688.7599 693.1404 696.0581 751.3930 791.5924 801.6516 810.4933 810.6495 864.0978 875.4023 921.8777 934.7089 936.5502 945.4112 980.5581 998.5008 1027.7285 1037.6106 1080.8335 1080.9913 1093.3876 1106.6324 1118.1342 1119.2834 1128.0392 1143.8280 1196.9294 1198.6272 1228.3039 1229.9129 1248.1299 1277.0737 1303.2009 1322.5471 1329.9094 1366.3210 1388.0238 1398.2419 1406.9962 1417.4330 1462.1162 1478.2840 1479.8020 1479.9100 1502.2792 1568.5367 1614.8404 2996.7535 3000.6395 3055.0100 3059.2067 3064.2835 3064.5523 3106.3357 3106.8604 3148.4326 3148.7627 3167.7278 3171.1183 3171.4819 3172.1299
redmass: 7.3566 5.3064 5.3488 4.1072 3.6791 4.0143 6.1739 5.4104 5.4180 7.5765 4.0305 3.3649 6.0479 4.3459 3.7319 4.2896 3.1531 2.2241 2.0830 2.6520 4.6387 4.3871 6.9444 4.1936 6.1215 4.1257 4.4861 1.2539 1.7580 2.5413 2.9990 2.6188 2.3142 1.3154 1.6355 1.3629 1.7324 4.3401 1.9361 1.2190 1.4658 2.5930 2.0503 1.4877 1.3641 1.4748 1.3676 1.3016 1.8352 1.1257 2.9105 1.5796 1.5470 1.5770 1.3512 1.3247 1.3284 1.3297 5.7089 2.3285 1.7353 1.6346 3.5167 1.0921 1.2009 1.1944 1.1975 2.3562 7.4274 6.2421 1.0603 1.0610 1.1020 1.1014 1.0534 1.0536 1.0920 1.0921 1.0873 1.0870 1.0960 1.1184 1.1183 1.0968
irintensity: 0.1669 0.1590 6.7552 5.5958 5.5053 5.3729 5.6799 0.2382 4.3987 0.3939 0.8577 0.8917 0.1183 5.3633 2.0869 6.4709 0.0021 26.7818 0.1807 16.9324 16.5891 30.7156 0.7753 7.0589 26.5697 5.7250 6.6701 0.0016 81.7627 47.1157 6.8876 0.9122 13.9219 0.6081 11.8730 2.5585 31.5250 12.5768 3.5706 0.9822 4.9864 24.0452 21.5672 2.8917 2.0605 0.2114 4.2281 6.9120 30.4034 25.2653 46.7570 6.1227 6.0532 100.6658 0.6353 1.0619 1.8429 30.5523 4.1417 64.3881 5.1563 0.2284 6.3355 31.0855 7.4180 8.6903 35.2250 286.2197 1.8800 136.4801 45.2001 4.0805 4.4473 1.1907 36.3998 29.9021 8.1900 15.4670 2.9837 19.9992 19.8683 35.3317 16.3234 2.5888
temp: 298.150 k
press: 1.00000 atm
elementType: 17 8 8 7 6 6 6 6 6 6 6 6 6 6 6 6 1 1 1 1 1 1 1 1 1 1 1 1 1 1
symmnumber: 1
zpe: 618971.5 jmol-1
zpe.correction: 0.235754 hartree
zpe.thermalcorrener: 0.251293 hartree
zpe.thermalcorrenthalpy: 0.252237 hartree
zpe.thermalcorrgfe: 0.190652 hartree
zpe.sumelectzpe: -1129.627819 hartree
zpe.sumelectthermal: -1129.612279 hartree
zpe.sumelectthermalent: -1129.611335 hartree
zpe.sumelectthermalfe: -1129.672921 hartree
dipole: -2.7680 -0.0009 -0.0014
dipole: 2.7680
quadrupole: -118.9357 -83.1054 -106.6572
quadrupole: 0.0063 -0.0001 -11.2423
quadrupole: -16.0363 19.7940 -3.7578 0.0063 -0.0001 -11.2423
hfenergy: -1129.8635726 hartree
pointgroup: C01 [X(C12H14Cl1N1O2)]
dipole: -1.0890019 -0.0006571 -0.006277 debye
polarizability: 229.7935759|0.1168707|140.7573979|0.7279364|-17.4443627|91.6475807 unknown
InChI: InChI=1S/C12H14ClNO2/c13-9-1-3-10(4-2-9)14(5-11-7-15-11)6-12-8-16-12/h1-4,11-12H,5-8H2
charge 0 multiplicity 1
30 atoms
Cl 5.575082 0.002342 0.031844
O  -2.821187 -1.980123 -1.08579
O  -2.831581 1.981747 1.06192
N  -0.506076 0.000676 -0.000471
C  -1.66252 -2.20972 -0.128146
C  -1.663391 2.211255 0.115162
C  -1.296586 -1.006344 0.728832
C  -1.289166 1.007703 -0.737685
C  -2.957911 -2.931957 0.078087
C  -2.956973 2.932977 -0.103636
C  0.897551 0.000942 0.007038
C  1.639733 -1.107201 0.527645
C  1.644553 1.109493 -0.505683
C  3.048722 -1.103692 0.541726
C  3.053648 1.107054 -0.504622
C  3.746899 0.001907 0.022245
H  -0.830967 -2.748107 -0.601406
H  -0.836672 2.74985 0.596535
H  -0.748985 -1.338242 1.630758
H  -2.227412 -0.523027 1.077783
H  -0.733022 1.339647 -1.63445
H  -2.216426 0.524322 -1.095815
H  -3.037752 -3.989949 -0.198822
H  -3.640631 -2.591898 0.867902
H  -3.039973 3.991125 0.171844
H  -3.631885 2.592411 -0.899962
H  1.125036 -1.992484 0.911658
H  1.133368 1.994464 -0.895049
H  3.593993 -1.963392 0.94319
H  3.602532 1.967123 -0.900334
