program: Gaussian 09
title: 000234786
version: EM64L-G09RevD.01
frameworkgroup: C1[X(C20H16Cl2O4S2)]
method: RPBEPBE
basis: SDD
operation: Freq
keyword: #p
keyword: freq=noraman
keyword: PBEPBE/SDD
title: #p freq=noraman PBEPBE/SDD
converged: YES YES NO NO
title: Mulliken charges:
elementType: Cl Cl S S O O O O C C C C C C C C C C C C C C C C C C C C H H H H H H H H H H H H H H H H
charge: -0.029870 -0.029870 0.904221 0.904222 -0.536746 -0.536608 -0.536737 -0.536617 -0.783888 -0.783888 0.532116 0.532114 -0.345037 -0.344617 -0.344639 -0.345058 -0.060669 -0.060670 -0.244794 -0.244776 -0.244664 -0.244682 -0.185249 -0.185251 -0.185279 -0.185277 -0.101613 -0.101613 0.273854 0.273671 0.273833 0.273691 0.244811 0.245174 0.245207 0.244845 0.293748 0.293740 0.293663 0.293670 0.268884 0.268885 0.268881 0.268880
chargesum: 0.00000
title: Mulliken charges with hydrogens summed into heavy atoms:
elementType: Cl Cl S S O O O O C C C C C C C C C C C C C C C C C C C C
charge: -0.029870 -0.029870 0.904221 0.904222 -0.536746 -0.536608 -0.536737 -0.536617 -0.236364 -0.236363 0.532116 0.532114 -0.100226 -0.099443 -0.099431 -0.100213 -0.060669 -0.060670 0.048954 0.048965 0.048999 0.048989 0.083635 0.083634 0.083602 0.083603 -0.101613 -0.101613
polarizability: 6.30894860e+02 -3.85570977e-02 2.61482474e+02 2.53454886e-04 -4.98742887e-02 1.63662343e+02
1716.lowfreq: -8.4513 -6.7602 -2.5070 -2.2785 -1.7477 -0.0015 -0.0013 -0.0012 11.1445
frequency: -5.9472 -4.1559 11.1445 13.4357 27.4467 33.7382 36.9963 48.4909 48.5888 83.2568 102.5080 114.8870 117.9224 125.8081 128.1290 179.6423 201.3143 201.5985 201.9252 232.7624 254.6078 256.5024 276.3282 284.8141 306.0063 321.4904 353.9844 358.2453 358.9255 377.4748 378.1513 400.3048 410.4324 410.4454 417.4604 431.7651 466.7466 472.0969 489.5129 506.5566 527.2254 529.1047 590.4479 611.4621 611.4669 633.9427 694.9548 695.5241 706.1408 706.4323 730.7524 776.8090 790.8119 792.5745 832.9698 833.8973 834.4580 834.5920 834.8917 835.2687 853.3409 858.4427 867.5922 939.7617 946.4643 960.1442 960.2047 960.7903 971.7305 974.1459 974.2038 983.9918 984.4430 1013.2182 1045.4998 1045.6947 1064.8569 1065.0642 1080.3740 1098.1685 1102.7681 1109.9816 1144.6436 1171.9172 1172.2427 1178.4081 1180.6449 1200.9941 1236.6038 1242.3564 1279.1866 1279.1877 1324.9316 1375.9341 1375.9391 1380.4612 1380.4706 1392.9148 1420.4394 1422.4601 1422.8219 1448.3820 1448.5346 1506.0141 1567.1052 1567.1278 1572.9608 1593.6923 1593.7090 1617.0259 3058.6841 3059.0936 3139.8441 3141.3292 3150.7682 3150.8693 3152.2616 3152.2638 3152.5869 3152.5933 3159.2878 3164.4790 3177.5190 3177.5203 3179.9250 3179.9416
redmass: 7.9124 12.0612 13.6915 5.4547 13.5107 3.6245 13.3847 4.8809 4.5335 9.2403 9.1445 10.1776 9.4063 7.5647 8.6019 11.8805 6.7990 13.8332 13.7969 8.2322 9.3328 8.7018 8.4603 7.6414 2.0749 7.4456 12.2676 5.4826 5.1979 2.1925 11.1824 2.7570 2.9060 2.9047 9.7854 6.4721 7.1788 4.4480 3.8039 8.9795 5.6446 4.9143 2.8401 7.1119 7.1128 6.4395 5.3880 5.3004 5.0083 5.0815 3.6524 4.3441 10.4984 12.9391 2.2281 1.2613 1.2420 1.2446 1.4494 1.9399 2.0830 2.0124 2.2171 4.2223 3.4537 1.3309 1.3318 1.3984 1.4124 1.3722 1.3770 6.7657 6.7783 2.8855 2.6484 2.6225 3.1989 3.2429 1.2862 1.2353 1.3294 1.1661 1.1683 1.1294 1.1293 1.1963 1.1673 1.1116 2.0764 4.5538 1.2333 1.2332 1.2660 2.9345 2.9305 11.3518 11.3873 6.3615 2.8815 1.1676 1.1893 2.1354 2.1358 2.6524 6.1416 6.1399 6.5674 8.2084 8.2098 6.1464 1.0566 1.0567 1.0884 1.0885 1.1116 1.1113 1.0901 1.0902 1.0902 1.0902 1.0972 1.0983 1.0956 1.0956 1.0968 1.0968
irintensity: 0.0001 0.4220 0.1639 0.0001 0.0188 0.0168 0.3417 2.1788 0.0002 12.3899 0.9529 7.9649 0.0001 7.1152 2.8177 0.0631 0.0020 13.8577 0.4259 39.3100 0.0076 0.0000 4.7356 5.0577 0.1028 14.6209 46.1976 0.0000 0.6180 0.0043 0.0530 0.0003 0.0108 0.0000 105.0067 10.6690 1.1271 0.0575 58.3662 122.0540 77.7518 27.6459 19.4074 0.0034 0.8335 0.0000 46.0667 0.3257 60.1447 1.0591 8.9660 0.9297 86.2463 12.4684 32.0081 0.3465 0.0252 2.5421 0.0386 112.8145 24.3868 22.0685 0.0001 95.5418 0.0032 0.1351 0.0342 2.1732 0.0000 0.0103 0.0000 125.2828 0.1683 5.1508 77.4850 0.0420 147.9438 0.5002 17.7296 0.0002 6.4356 0.0000 5.1812 37.1957 0.5134 0.3832 28.0589 0.1781 35.6147 1.3584 4.4239 0.1174 0.0000 30.9590 0.0626 1.8592 0.0007 2.4241 15.2125 1.9114 4.4616 143.1371 0.0789 0.9914 47.3720 1.4305 0.0000 0.0005 3.6213 0.8663 41.3401 1.8686 0.0005 17.5508 0.8108 0.0003 2.1173 0.1122 9.1101 0.2796 9.9094 1.5602 0.2455 0.2886 12.5656 0.0266
temp: 298.150 k
press: 1.00000 atm
elementType: 17 17 16 16 8 8 8 8 6 6 6 6 6 6 6 6 6 6 6 6 6 6 6 6 6 6 6 6 1 1 1 1 1 1 1 1 1 1 1 1 1 1 1 1
symmnumber: 1
zpe: 804800.5 jmol-1
zpe.correction: 0.306532 hartree
zpe.thermalcorrener: 0.332718 hartree
zpe.thermalcorrenthalpy: 0.333662 hartree
zpe.thermalcorrgfe: 0.245885 hartree
zpe.sumelectzpe: -2786.549749 hartree
zpe.sumelectthermal: -2786.523564 hartree
zpe.sumelectthermalent: -2786.522620 hartree
zpe.sumelectthermalfe: -2786.610396 hartree
dipole: 0.0000 0.0020 8.3567
dipole: 8.3567
quadrupole: -165.5309 -179.7340 -204.9731
quadrupole: -0.0920 0.0001 -0.0023
quadrupole: 17.8818 3.6787 -21.5605 -0.0920 0.0001 -0.0023
hfenergy: -2786.8562817 hartree
pointgroup: C01 [X(C20H16Cl2O4S2)]
dipole: -0.0000106 0.003306 3.2877775 debye
polarizability: 630.8948498|-0.0719348|261.4824569|0.001425|-0.0715087|163.6623695 unknown
InChI: InChI=1S/C20H16Cl2O4S2/c21-17-5-9-19(10-6-17)27(23,24)13-15-1-2-16(4-3-15)14-28(25,26)20-11-7-18(22)8-12-20/h1-12H,13-14H2
charge 0 multiplicity 1
44 atoms
Cl -10.049719 0.008539 -0.030908
Cl 10.049673 -0.004005 -0.030827
S  -3.604505 -0.006789 -0.613411
S  3.604452 0.004445 -0.613397
O  -3.198898 -1.450069 -1.270212
O  -3.193353 1.428655 -1.283625
O  3.197557 1.446328 -1.272454
O  3.194596 -1.432417 -1.281373
C  -2.904897 0.000052 1.293026
C  2.904834 -0.000096 1.293044
C  -1.423215 -0.000024 1.272908
C  1.423152 -0.000098 1.272917
C  -0.702784 1.226476 1.247917
C  0.702813 1.226475 1.248097
C  -0.702877 -1.226626 1.249392
C  0.702722 -1.226628 1.24922
C  -5.491819 -0.002194 -0.411412
C  5.491768 0.001895 -0.411377
C  -6.152284 1.237172 -0.376779
C  6.153387 -1.236798 -0.374741
C  -6.157118 -1.238565 -0.364362
C  6.155915 1.238959 -0.366316
C  -7.560868 1.239596 -0.258278
C  7.561972 -1.237719 -0.256227
C  -7.565697 -1.23431 -0.245841
C  7.564496 1.236207 -0.247781
C  -8.238348 0.00429 -0.18604
C  8.2383 -0.001669 -0.185978
H  -3.372708 -0.913494 1.688678
H  -3.372554 0.916169 1.682868
H  3.372564 0.913965 1.687602
H  3.372567 -0.915703 1.683988
H  -1.250708 2.174416 1.2206
H  1.250826 2.174353 1.220785
H  -1.250896 -2.174529 1.223075
H  1.250652 -2.174591 1.222903
H  -5.587413 2.170242 -0.474451
H  5.589387 -2.170551 -0.470907
H  -5.595907 -2.174773 -0.452656
H  5.593832 2.174499 -0.456129
H  -8.117971 2.180013 -0.231295
H  8.11995 -2.177571 -0.22772
H  -8.126454 -2.172226 -0.209385
H  8.12438 2.174703 -0.212839
