program: Gaussian 09
title: 000234781
version: EM64L-G09RevD.01
frameworkgroup: C1[X(C7H6INO2)]
method: RPBEPBE
basis: SDD
operation: Freq
keyword: #p
keyword: freq=noraman
keyword: PBEPBE/SDD
title: #p freq=noraman PBEPBE/SDD
converged: NO YES NO YES
title: Mulliken charges:
elementType: I O O N C C C C C C C H H H H H H
charge: 0.185513 -0.209593 -0.187101 0.021923 0.583120 -0.625229 0.493262 -0.419648 -0.367053 -0.191162 -0.827686 0.246556 0.297660 0.244077 0.261185 0.261182 0.232995
chargesum: 0.00000
title: Mulliken charges with hydrogens summed into heavy atoms:
elementType: I O O N C C C C C C C
charge: 0.185513 -0.209593 -0.187101 0.021923 0.583120 -0.625229 0.493262 -0.173093 -0.069393 0.052916 -0.072324
polarizability: 1.61720792e+02 -6.66247421e+00 1.38059217e+02 5.09047350e-03 3.67892304e-04 4.33989215e+01
1716.lowfreq: -53.8374 -8.4024 -4.8149 -0.0007 -0.0006 -0.0004 13.3769 63.9360 166.9670
frequency: -53.8318 63.9327 166.9650 186.2223 201.3933 214.0276 240.8451 263.5698 376.4855 411.1727 476.4916 496.3968 505.7314 556.3814 675.7426 677.2941 715.1560 757.7406 808.6918 869.2182 933.4379 995.3364 998.6880 1005.0427 1049.5285 1110.0657 1145.0880 1179.2729 1190.8720 1255.2077 1354.0051 1371.9420 1402.4703 1404.1608 1443.4985 1463.3213 1471.7266 1575.0391 1586.2188 2985.8903 3066.8069 3093.1308 3141.0097 3164.6934 3191.7020
redmass: 15.9482 4.5105 19.1400 2.4262 1.3881 7.0739 2.9553 7.1027 5.5903 5.1424 4.7298 4.7442 3.5610 6.5505 5.6792 8.8402 3.2042 8.6467 1.4608 5.5172 1.3446 7.4203 1.3511 1.5140 1.5550 1.6742 2.8738 1.3109 8.0343 2.0686 7.6510 5.2972 2.7942 1.2527 2.9420 1.0445 1.1142 6.1545 6.4180 1.0371 1.0971 1.0995 1.0887 1.0942 1.0957
irintensity: 0.0004 0.7063 1.1598 1.1532 0.4416 0.9793 4.2852 1.1815 2.8452 1.7952 6.3783 0.0628 0.0015 5.8161 2.7775 14.3806 18.5559 18.9511 48.1659 13.6035 2.1926 42.7787 1.3377 18.1170 10.0303 3.8341 16.6080 30.9697 234.3713 1.7492 40.2690 27.0154 42.5260 37.3385 48.4577 15.4352 33.8061 15.8159 9.7642 13.6886 8.6548 18.8140 8.1813 13.1071 6.6321
temp: 298.150 k
press: 1.00000 atm
elementType: 53 8 8 7 6 6 6 6 6 6 6 1 1 1 1 1 1
symmnumber: 1
zpe: 306492.9 jmol-1
zpe.correction: 0.116737 hartree
zpe.thermalcorrener: 0.126062 hartree
zpe.thermalcorrenthalpy: 0.127006 hartree
zpe.thermalcorrgfe: 0.080507 hartree
zpe.sumelectzpe: -486.161662 hartree
zpe.sumelectthermal: -486.152337 hartree
zpe.sumelectthermalent: -486.151393 hartree
zpe.sumelectthermalfe: -486.197892 hartree
dipole: -0.2988 5.8143 -0.0012
dipole: 5.8220
quadrupole: -70.7923 -80.5190 -79.5178
quadrupole: -7.9273 0.0023 0.0045
quadrupole: 6.1508 -3.5759 -2.5748 -7.9273 0.0023 0.0045
hfenergy: -486.2783992 hartree
pointgroup: C01 [X(C7H6I1N1O2)]
dipole: -2.233986 0.50586 0.0006898 debye
dipolederiv: 0.1355281 0.0778589 -0.0000433 0.031918 -0.4089257 0.0001744 0.0000507 0.0000425 0.0675856 -0.7983678 -0.3075754 0.0002058 -0.227478 -0.6472461 0.0000319 0.0005779 0.000579 -0.2297541 -0.6144996 0.0730459 0.0000448 0.1553007 -0.5870553 0.0003322 0.0002033 -0.0001583 -0.1988537 1.7204407 0.2650098 -0.0004929 -0.0914409 1.0256914 -0.0003027 -0.0005013 -0.0004227 0.182198 0.0844264 0.42443 -0.0001755 0.4418464 -0.3424276 0.0001652 -0.0001656 0.0002274 0.0348265 0.0528703 -0.4797197 0.0001484 0.0601297 0.9500575 -0.0005324 -0.000182 -0.0002734 -0.1824765 -0.674311 0.1077173 0.0001975 0.0957058 -0.1815321 0.0000911 -0.0000688 0.0000962 0.1157566 0.1091876 0.0622357 -0.0000113 -0.1408425 0.1681323 -0.0000894 0.0000317 -0.0001014 -0.1357211 0.0626368 0.0102609 0.0000028 -0.2262668 -0.1546245 0.0000678 -0.0000641 -0.0000724 -0.1226351 -0.204123 -0.1994075 0.0000793 -0.0688206 0.1005736 -0.0001087 0.0000446 -0.0000724 -0.1257874 -0.0115984 -0.1268721 0.0000324 -0.1721267 -0.0754212 0.0000112 0.0001135 -0.0000765 0.0225498 -0.0863709 0.0581334 0.0000032 0.0309933 0.0663879 0.0000286 -0.0000177 0.0000154 0.1509785 0.102339 -0.0432423 -0.0000043 -0.0207352 0.0764104 0.000027 -0.0000009 0.0000496 0.1767794 0.07172 0.0378365 0.0000054 0.0444313 -0.0816525 0.0000903 0.0000238 0.0000983 0.1582376 0.0688995 -0.0065395 0.0330373 -0.0466925 0.0339279 -0.086209 -0.0015661 -0.0902387 -0.015535 0.0688982 -0.0065811 -0.0330339 -0.0466775 0.0340316 0.0862096 0.0015712 0.0902816 -0.0156696 -0.0876762 0.0534091 0.0000042 0.1807552 0.0236725 0.0000129 -0.0000502 0.0000256 0.1175206 unknown
polarizability: 136.5083854|-2.2996643|163.2716086|-0.0155632|-0.0388156|43.3989367 unknown
InChI: InChI=1S/C7H6INO2/c1-5-3-2-4-6(7(5)8)9(10)11/h2-4H,1H3
charge 0 multiplicity 1
17 atoms
I  -0.026093 -2.803274 0.001092
O  2.88037 1.069019 -0.001237
O  2.505351 -1.168361 -0.000506
N  2.087044 0.046822 0.00003
C  -1.773168 -0.283746 0.000365
C  -0.398856 -0.682124 0.000387
C  0.614366 0.321498 -0.000005
C  -2.079473 1.101378 -0.00009
C  0.275363 1.698127 -0.000491
C  -1.070991 2.086702 -0.000514
C  -2.919083 -1.276258 0.000798
H  -3.133074 1.401301 -0.000113
H  1.089781 2.42581 -0.000792
H  -1.33513 3.148497 -0.00086
H  -2.885988 -1.936125 -0.885184
H  -2.885866 -1.935497 0.887243
H  -3.886755 -0.747769 0.000679
