program: Gaussian 09
title: 000234782
version: EM64L-G09RevD.01
frameworkgroup: C1[X(C10H6N2O5S)]
method: RPBEPBE
basis: SDD
operation: Freq
keyword: #p
keyword: freq=noraman
keyword: PBEPBE/SDD
title: #p freq=noraman PBEPBE/SDD
converged: NO NO NO NO
title: Mulliken charges:
elementType: S O O O O O N N C C C C C C C C C C H H H H H H
charge: 0.323049 -0.177472 -0.195476 -0.195447 -0.217074 -0.199594 0.028007 0.047834 -0.237989 -0.050092 -0.155237 -0.154943 0.391051 -0.329682 -0.329709 -0.222637 0.287122 -0.308732 0.266784 0.266767 0.294507 0.294513 0.276881 0.297569
chargesum: 0.00000
title: Mulliken charges with hydrogens summed into heavy atoms:
elementType: S O O O O O N N C C C C C C C C C C
charge: 0.323049 -0.177472 -0.195476 -0.195447 -0.217074 -0.199594 0.028007 0.047834 -0.237989 -0.050092 0.111547 0.111823 0.391051 -0.035175 -0.035196 0.054244 0.287122 -0.011163
polarizability: 2.29209264e+02 1.48319417e+01 1.72047530e+02 2.71686381e-02 1.02614325e-01 1.14010776e+02
1716.lowfreq: -27.5722 -21.0957 -3.1989 -0.0021 -0.0020 -0.0007 2.0893 9.4733 26.0933
frequency: -27.4742 -20.2617 26.0267 64.8137 67.4953 90.8784 132.1844 152.8748 179.2029 242.3918 262.9273 268.5474 296.9613 360.9050 368.3477 407.3087 463.1112 489.7024 503.8212 505.7269 547.8246 557.5259 609.9822 619.1084 662.2047 678.0652 690.5226 729.7190 732.4302 786.1258 797.3828 846.1639 863.2049 889.7739 894.9749 907.7771 985.8788 993.7577 996.3490 1014.8169 1066.2513 1087.3501 1095.0875 1102.3540 1139.2993 1176.1764 1189.0151 1214.6796 1259.8063 1284.5033 1335.2192 1358.7600 1366.4810 1390.7974 1406.2135 1434.6301 1458.1986 1542.6052 1587.3942 1599.8669 3165.7286 3166.8416 3188.9398 3191.5003 3238.4449 3259.2745
redmass: 6.3702 4.8922 13.2998 10.0211 11.5727 9.3544 9.9707 10.8154 12.3442 6.7823 7.6940 9.6518 5.9956 11.5783 10.4870 2.8596 5.9678 5.4749 7.5499 8.7562 8.6743 6.0567 4.9659 7.1331 4.6460 9.5100 8.8380 4.9999 9.7748 9.5884 1.2556 1.2391 1.5793 8.4904 1.3768 7.5593 1.3676 1.3782 4.3323 1.3084 2.4281 4.3601 5.2868 1.3023 8.7226 1.2481 1.6716 7.4696 8.4729 1.2468 4.8678 8.2410 5.7657 6.7019 5.9259 6.9859 2.3146 6.7542 6.4147 8.3284 1.0908 1.0906 1.0957 1.0971 1.0957 1.1038
irintensity: 1.6823 0.7543 0.4716 0.0864 0.4623 5.9486 0.9724 0.3945 3.5194 2.2258 0.3521 2.6016 0.0947 3.6899 4.0892 0.0166 12.1299 2.3902 0.6215 6.3602 0.7410 0.2363 0.0472 0.3927 24.5461 11.3656 7.8860 11.6591 9.5121 47.2713 66.4587 0.0891 56.8379 24.8952 5.2196 2.9760 5.1613 0.0541 24.1725 36.4812 7.1203 9.1314 33.8507 14.7225 116.0430 27.4733 4.5889 242.0108 273.7782 0.0868 34.1411 111.7193 57.4941 23.7981 74.7266 397.8118 18.9248 35.9208 25.1919 1.4164 1.9892 0.0316 0.9843 4.4768 0.0465 6.8094
temp: 298.150 k
press: 1.00000 atm
elementType: 16 8 8 8 8 8 7 7 6 6 6 6 6 6 6 6 6 6 1 1 1 1 1 1
symmnumber: 1
zpe: 394721.2 jmol-1
zpe.correction: 0.150341 hartree
zpe.thermalcorrener: 0.164211 hartree
zpe.thermalcorrenthalpy: 0.165156 hartree
zpe.thermalcorrgfe: 0.107725 hartree
zpe.sumelectzpe: -1266.856838 hartree
zpe.sumelectthermal: -1266.842968 hartree
zpe.sumelectthermalent: -1266.842024 hartree
zpe.sumelectthermalfe: -1266.899455 hartree
dipole: -2.8563 -7.3615 -0.0025
dipole: 7.8962
quadrupole: -125.5451 -123.2093 -103.0144
quadrupole: 6.5538 0.0294 0.0268
quadrupole: -8.2888 -5.9531 14.2419 6.5538 0.0294 0.0268
hfenergy: -1267.0071793 hartree
pointgroup: C01 [X(C10H6N2O5S1)]
dipole: 1.0811889 2.9123814 -0.0014745 debye
dipolederiv: -0.4870098 0.3320452 0.0004761 0.365393 -0.0150498 0.000493 0.0024082 -0.0011785 -0.0108114 -0.5913862 -0.1089005 0.0010268 0.0120195 -0.3860215 0.0002572 0.0020764 -0.0001656 -0.0367317 -0.5968581 -0.1930031 -0.1607327 -0.2593712 -0.34438 -0.1059219 -0.1396042 -0.064157 -0.6527438 -0.5963866 -0.193708 0.159523 -0.2598819 -0.345179 0.1077162 0.1381575 0.0658863 -0.6521899 -0.8721158 0.4286147 0.0008368 0.3480055 -0.7305469 -0.0001594 0.0007461 -0.0002826 -0.2422129 -0.5007954 -0.3722938 0.0007386 -0.0273236 -0.7034573 0.0005611 0.0007358 0.0013236 -0.207531 1.3363937 0.613735 0.0015785 0.7905446 0.606722 -0.0016436 0.0018419 -0.0015748 1.0884003 1.1032685 -0.012821 -0.0016651 -0.5478434 2.07316 -0.0007488 -0.0012846 -0.0015462 0.2087865 0.6478224 0.1764293 0.0005527 0.305403 -0.1518676 -0.0005332 -0.0007433 0.0000924 0.1340935 1.2673586 -0.7697275 -0.0018523 -0.5463101 0.2800065 -0.0000439 -0.0033919 0.0016658 -0.0063478 -0.2999984 -0.0181594 -0.1929498 -0.1677188 -0.087187 -0.1118192 0.0025921 -0.0515533 0.0128706 -0.2990208 -0.0192796 0.1931783 -0.1677354 -0.0882056 0.1111364 -0.0026444 0.0510077 0.0133091 -0.3773695 -0.213695 -0.0003407 -0.3099065 -0.0742796 -0.0002391 -0.0004502 -0.0002231 0.0821181 0.00437 0.0644275 0.1350583 0.0910902 -0.0281548 0.1066976 -0.1743568 -0.0689176 -0.0525041 0.0045362 0.0651351 -0.1348376 0.0901076 -0.0278361 -0.1068605 0.1745616 0.06899 -0.0525188 -0.6790428 0.6349931 0.0001707 0.3729313 -0.2357284 -0.0003882 0.0001715 -0.000956 -0.180087 0.3860424 -0.3588517 -0.0001715 0.4294575 -1.0263528 0.0002197 -0.001051 0.0014713 0.0535898 -0.1199214 0.0987943 -0.0003692 -0.381333 0.6443829 0.0000357 0.0004157 -0.0008898 -0.1077368 0.1063385 -0.0603151 0.0600763 -0.0388645 0.098581 0.0291586 0.0722854 0.0127783 0.0253248 0.1060971 -0.0600043 -0.0604723 -0.038485 0.0987025 -0.0285722 -0.0726147 -0.0123253 0.0253007 0.115397 -0.0241515 -0.0425573 -0.0413364 0.1489847 -0.0308021 -0.0101955 -0.0106426 0.0778836 0.1155337 -0.0243257 0.0422898 -0.0413426 0.1487353 0.0312524 0.009924 0.0110262 0.0780497 0.1395833 -0.0073013 0.0002138 -0.0334188 0.0195971 0.0002314 0.0001253 0.0002093 0.2025952 0.0871633 0.0223632 0.0002289 0.055919 0.1253743 -0.0000273 0.000295 -0.0000386 0.1990933 unknown
polarizability: 228.7624321|15.6630002|172.4943152|-0.0036488|-0.1140256|114.0108233 unknown
InChI: InChI=1S/C10H6N2O5S/c13-11(14)7-1-3-8(4-2-7)18-10-6-5-9(17-10)12(15)16/h1-6H
charge 0 multiplicity 1
24 atoms
S  0.775894 2.697088 0.003789
O  1.818664 0.126463 0.00257
O  -4.687546 -1.217423 -1.143822
O  -4.685869 -1.223224 1.139587
O  4.242539 -2.526682 -0.000514
O  1.93987 -2.590447 0.004239
N  -4.19347 -0.878723 -0.00161
N  3.070712 -1.963691 0.00104
C  -0.696771 1.567497 0.002007
C  2.120392 1.494073 0.000965
C  -1.263077 1.175731 -1.231037
C  -1.261208 1.169423 1.233879
C  -2.968489 -0.025793 -0.000346
C  -2.416143 0.364787 -1.237627
C  -2.414245 0.358424 1.238076
C  3.502848 1.692066 -0.002293
C  3.066997 -0.531669 0.000269
C  4.10688 0.388357 -0.002388
H  -0.807674 1.496949 -2.172103
H  -0.804334 1.48578 2.175873
H  -2.883069 0.035423 -2.16904
H  -2.879702 0.024238 2.168505
H  4.015523 2.650693 -0.004256
H  5.166578 0.147759 -0.004465
