program: Gaussian 09
title: 000234778
version: EM64L-G09RevD.01
frameworkgroup: C1[X(C4H2INO2S)]
method: RPBEPBE
basis: SDD
operation: Freq
keyword: #p
keyword: freq=noraman
keyword: PBEPBE/SDD
title: #p freq=noraman PBEPBE/SDD
converged: NO YES NO YES
title: Mulliken charges:
elementType: I S O O N C C C C H H
charge: 0.236858 0.435315 -0.205963 -0.211594 0.086389 -0.089584 -0.201741 0.010057 -0.640943 0.303243 0.277962
chargesum: 0.00000
title: Mulliken charges with hydrogens summed into heavy atoms:
elementType: I S O O N C C C C
charge: 0.236858 0.435315 -0.205963 -0.211594 0.086389 -0.089584 0.101503 0.288019 -0.640943
polarizability: 1.89155883e+02 -2.67664212e+00 9.08524047e+01 -1.40559877e-02 -5.13746090e-03 2.96754584e+01
1716.lowfreq: -8.0866 0.0008 0.0009 0.0020 0.8816 11.5748 72.7132 94.0680 119.2720
frequency: 72.7078 94.0589 119.2706 215.2761 236.0871 240.9041 408.2324 439.5012 471.2831 542.4500 620.2228 673.7240 681.5172 729.3389 812.9657 896.4144 926.0541 1015.9604 1097.3603 1194.5480 1233.1856 1307.7648 1352.3301 1433.3487 1523.8965 3196.9566 3212.2738
redmass: 12.8572 15.4946 16.1193 23.4188 9.4917 8.0975 11.4958 7.1964 10.2794 3.1917 12.2989 9.8613 6.8807 11.9565 1.2572 6.2925 1.4162 2.4462 2.6589 1.5397 4.9252 3.7016 12.9611 7.6619 6.1510 1.0918 1.1009
irintensity: 1.0308 0.0002 1.8868 2.0368 0.4870 3.4713 6.5570 15.2862 1.2462 1.0789 1.5359 21.1405 1.6951 16.0452 56.2859 43.0706 2.0626 13.9919 30.1635 14.1068 396.8446 59.8661 116.7976 231.1012 26.8941 1.7354 3.0081
temp: 298.150 k
press: 1.00000 atm
elementType: 53 16 8 8 7 6 6 6 6 1 1
symmnumber: 1
zpe: 148023.7 jmol-1
zpe.correction: 0.056379 hartree
zpe.thermalcorrener: 0.064798 hartree
zpe.thermalcorrenthalpy: 0.065742 hartree
zpe.thermalcorrgfe: 0.020430 hartree
zpe.sumelectzpe: -767.624686 hartree
zpe.sumelectthermal: -767.616267 hartree
zpe.sumelectthermalent: -767.615323 hartree
zpe.sumelectthermalfe: -767.660635 hartree
dipole: 4.8437 2.3201 0.0012
dipole: 5.3707
quadrupole: -90.9507 -69.8897 -73.9153
quadrupole: -4.7284 -0.0036 -0.0005
quadrupole: -12.6989 8.3622 4.3366 -4.7284 -0.0036 -0.0005
hfenergy: -767.6810651 hartree
pointgroup: C01 [X(C4H2I1N1O2S1)]
dipole: 1.9843268 -0.726045 -0.0004602 debye
dipolederiv: -0.511199 -0.0874206 -0.0001282 -0.148246 0.0521362 -0.0000202 0.0000357 0.0000192 0.1385875 0.0217645 0.0498682 -0.0000748 -0.0599228 -0.1388947 0.0000822 -0.0001837 0.0001952 0.2556258 -0.9612344 -0.2116278 0.0000427 -0.3967728 -0.5810994 -0.0000075 0.0001649 0.000028 -0.2297676 -0.6833679 0.1270209 0.0000278 0.3441347 -0.6891602 0.00003 0.0000721 -0.0000281 -0.2303447 2.1682804 -0.0277082 -0.0001072 -0.2268447 1.0307495 0.0000246 -0.0003248 0.0000054 0.2346929 -1.0413851 0.2423525 -0.0002169 0.7143048 0.2066606 -0.0001894 0.0001648 -0.0000911 -0.1119679 0.5238831 0.1082422 -0.0000169 -0.4114709 -0.1634967 0.0000722 0.0001917 0.0000354 -0.0570662 -0.7351604 -0.3046507 -0.0000201 -0.4497348 -0.17023 0.0000801 -0.0001702 -0.0001045 -0.0948808 1.0706146 0.0925297 0.000522 0.5863437 0.3240228 -0.0000994 0.0002019 -0.0000863 -0.3118577 0.0864116 -0.0407634 0.0000129 -0.0213568 0.0894878 0.0000099 -0.0000945 0.00002 0.2085018 0.0613927 0.0521571 -0.0000414 0.0695656 0.039824 0.0000176 -0.000058 0.0000068 0.1984768 unknown
polarizability: 187.7432261|12.0015801|92.2650618|0.0144835|-0.0037673|29.6754584 unknown
InChI: InChI=1S/C4H2INO2S/c5-3-1-2-4(9-3)6(7)8/h1-2H
charge 0 multiplicity 1
11 atoms
I  3.924843 0.652884 0.000638
S  0.582803 1.268369 -0.000722
O  -2.819498 -0.837528 0.000285
O  -2.383245 1.419732 0.000191
N  -2.014046 0.175619 0.000088
C  -0.598761 -0.096476 -0.00012
C  0.007191 -1.346374 -0.000223
C  1.438025 -1.265682 -0.000013
C  1.910216 0.045712 0.000233
H  -0.564423 -2.276121 -0.000194
H  2.093492 -2.137735 0.000137
