program: Gaussian 09
title: 000234755
version: EM64L-G09RevD.01
frameworkgroup: C1[X(C10H18N2O2)]
method: RPBEPBE
basis: SDD
operation: Freq
keyword: #p
keyword: freq=noraman
keyword: PBEPBE/SDD
title: #p freq=noraman PBEPBE/SDD
converged: YES YES NO NO
title: Mulliken charges:
elementType: O O N N C C C C C C C C C C H H H H H H H H H H H H H H H H H H
charge: -0.215778 -0.232288 -0.454867 -0.407571 0.302084 -0.429506 -0.404807 -0.347940 0.103536 -0.356196 0.159583 -0.358497 -0.701440 -0.698037 0.199638 0.226017 0.225550 0.197177 0.202892 0.214110 0.313647 0.210223 0.222546 0.193070 0.200653 0.345326 0.207418 0.215811 0.223218 0.214479 0.212219 0.217731
chargesum: 0.00000
title: Mulliken charges with hydrogens summed into heavy atoms:
elementType: O O N N C C C C C C C C C C
charge: -0.215778 -0.232288 -0.141220 -0.062245 0.302084 -0.003851 0.017919 0.069062 0.103536 0.076573 0.159583 0.035226 -0.054994 -0.053608
polarizability: 1.27935120e+02 4.59028967e-01 1.32692987e+02 6.91981670e-01 -4.34848077e+00 1.11645474e+02
1716.lowfreq: -3.5177 -0.0003 0.0006 0.0007 2.4573 10.4027 48.0265 54.3881 64.7128
frequency: 47.6275 54.3321 64.5324 73.0184 80.9193 90.1149 129.7239 159.6529 171.0611 197.1252 226.0272 231.5792 259.4179 272.4770 289.8047 322.0388 368.4674 430.2119 469.0199 550.4483 564.0803 605.7293 618.2882 654.1619 711.1481 723.9273 727.8088 744.3353 754.9194 791.5316 861.8484 887.7717 905.7724 913.7428 966.9369 993.3574 1009.1898 1044.1424 1057.6430 1080.0687 1089.9598 1095.7401 1124.5018 1137.4753 1162.2900 1203.7659 1221.6768 1255.3179 1260.9732 1282.0403 1287.5190 1293.9498 1305.5551 1313.6670 1322.3750 1331.5124 1348.7079 1355.6429 1375.8474 1390.2574 1394.4011 1445.1362 1459.2401 1469.0524 1473.8747 1477.0840 1477.6290 1478.1639 1486.0047 1488.6099 1676.9177 1718.7568 2963.3837 2965.9187 2971.0297 2974.9537 2975.6394 2976.9239 2984.0199 3004.4808 3023.3176 3027.0013 3045.7149 3051.5834 3072.1293 3072.6108 3075.0212 3078.1893 3587.7390 3603.9156
redmass: 3.2656 5.5363 2.3237 1.6186 2.5596 3.0722 2.4105 5.1455 3.1505 2.6806 1.1356 1.1704 3.4592 3.5080 3.0884 3.7275 6.6211 3.1846 1.1696 3.7950 3.4370 8.0885 4.5497 1.2203 9.1736 2.2356 1.3918 1.7066 1.8864 1.3614 1.4022 1.9203 1.8697 1.3782 3.0702 1.8738 3.1424 2.9522 2.3988 2.1176 1.6629 2.2393 2.8443 2.9896 2.9861 2.0942 1.4785 1.3717 1.3858 1.2519 1.2307 1.0779 1.9839 2.2116 1.6574 1.6630 1.5529 1.6065 1.6081 1.2177 1.2169 1.0802 1.0982 1.0679 1.0523 1.0642 1.0437 1.0438 1.0811 1.0847 8.2307 9.3983 1.0591 1.0621 1.0599 1.0382 1.0374 1.0582 1.0595 1.0985 1.0984 1.0999 1.1026 1.1017 1.1008 1.1012 1.0994 1.0993 1.0802 1.0799
irintensity: 0.1027 0.0271 0.1442 0.0462 0.1889 0.6047 0.5071 3.6140 0.6827 0.4262 0.0330 0.1722 2.4167 0.6324 0.4473 0.1914 13.8419 4.5306 128.7182 2.8838 11.4518 6.5571 7.1800 149.4727 41.5230 9.2236 3.7914 16.2287 17.5831 2.9997 0.8144 9.5910 0.5357 2.4517 16.8670 1.3109 1.5820 6.9188 4.8605 6.6748 5.4233 9.1817 16.6754 22.4460 0.7767 32.3811 12.7989 13.6808 11.1136 0.4577 8.4718 2.1749 89.8416 53.3603 38.2363 29.6383 0.2692 2.5500 2.1447 8.1117 12.1770 0.0334 9.4204 0.7376 3.7479 3.1427 14.5100 11.5991 10.8958 17.7321 466.3561 385.2468 13.5153 2.5641 5.5919 35.7908 14.7263 85.9063 57.1631 3.2476 0.4814 5.8253 2.5776 28.5449 16.4725 132.4986 50.2235 42.6896 67.7677 35.7962
temp: 298.150 k
press: 1.00000 atm
elementType: 8 8 7 7 6 6 6 6 6 6 6 6 6 6 1 1 1 1 1 1 1 1 1 1 1 1 1 1 1 1 1 1
symmnumber: 1
zpe: 716331.2 jmol-1
zpe.correction: 0.272836 hartree
zpe.thermalcorrener: 0.288755 hartree
zpe.thermalcorrenthalpy: 0.289699 hartree
zpe.thermalcorrgfe: 0.228964 hartree
zpe.sumelectzpe: -650.752715 hartree
zpe.sumelectthermal: -650.736796 hartree
zpe.sumelectthermalent: -650.735852 hartree
zpe.sumelectthermalfe: -650.796587 hartree
dipole: 0.2499 -2.6707 -1.8833
dipole: 3.2775
quadrupole: -82.5719 -96.5162 -88.7896
quadrupole: 1.3192 0.1864 9.9537
quadrupole: 6.7207 -7.2237 0.5030 1.3192 0.1864 9.9537
hfenergy: -651.025551 hartree
pointgroup: C01 [X(C10H18N2O2)]
dipole: 0.104876 -1.0355737 -0.7611107 debye
polarizability: 127.9261265|0.4449403|132.8591865|0.780944|-3.9259642|111.4882685 unknown
InChI: InChI=1S/C10H18N2O2/c1-3-5-7-10(6-4-2)8(13)11-9(14)12-10/h11-12H,3-7H2,1-2H3
charge 0 multiplicity 1
32 atoms
O  -0.408886 -0.313149 2.313639
O  -0.563087 3.213651 -0.817751
N  -0.417153 0.845105 -1.062275
N  -0.503986 1.671932 1.014981
C  -0.358677 -0.356103 -0.197685
C  0.974669 -1.145806 -0.36609
C  -1.576328 -1.305887 -0.409529
C  2.261712 -0.328383 -0.126707
C  -0.424364 0.29211 1.215014
C  -2.963673 -0.646656 -0.251517
C  -0.501429 2.043474 -0.370863
C  3.537872 -1.151116 -0.417372
C  -4.107525 -1.638135 -0.554663
C  4.833613 -0.353387 -0.158194
H  0.988906 -1.576708 -1.389012
H  0.941562 -1.997239 0.34081
H  -1.476143 -2.132314 0.320282
H  -1.489212 -1.755855 -1.420405
H  2.258542 0.578392 -0.764267
H  2.290478 0.02032 0.925227
H  -0.393688 0.821541 -2.079898
H  -3.041498 0.228443 -0.925586
H  -3.075283 -0.264559 0.782152
H  3.518899 -1.496051 -1.471821
H  3.534158 -2.065846 0.209765
H  -0.558397 2.367172 1.759655
H  -4.04266 -2.017585 -1.592129
H  -4.070303 -2.509749 0.125241
H  -5.095123 -1.157864 -0.433144
H  4.891868 -0.024962 0.896439
H  4.877416 0.551218 -0.793474
H  5.731622 -0.961006 -0.372624
