program: Gaussian 09
title: 000234754
version: EM64L-G09RevD.01
frameworkgroup: C1[X(C9H16N2O2)]
method: RPBEPBE
basis: SDD
operation: Freq
keyword: #p
keyword: freq=noraman
keyword: PBEPBE/SDD
title: #p freq=noraman PBEPBE/SDD
converged: YES YES NO NO
title: Mulliken charges:
elementType: O O N N C C C C C C C C C H H H H H H H H H H H H H H H H
charge: -0.215559 -0.232293 -0.453616 -0.407523 0.295128 -0.399894 -0.399822 0.105382 -0.355083 -0.355124 0.160883 -0.701109 -0.701106 0.224943 0.196064 0.196045 0.224882 0.313981 0.210057 0.222848 0.222877 0.210075 0.345509 0.207326 0.215657 0.223249 0.215646 0.207327 0.223252
chargesum: 0.00000
title: Mulliken charges with hydrogens summed into heavy atoms:
elementType: O O N N C C C C C C C C C
charge: -0.215559 -0.232293 -0.139635 -0.062015 0.295128 0.021113 0.021105 0.105382 0.077823 0.077828 0.160883 -0.054878 -0.054881
polarizability: 1.11777823e+02 -3.88605650e-03 1.24367761e+02 1.42228608e-03 -4.43590751e+00 1.03462583e+02
1716.lowfreq: -0.0011 -0.0008 -0.0008 0.7100 8.1408 11.1717 58.4900 64.7070 78.4778
frequency: 58.4690 64.6949 78.3608 83.2807 96.8277 98.5844 161.2928 178.6958 228.7750 229.7380 242.3614 262.8531 290.2331 326.3830 329.6788 383.4976 470.7108 555.1636 562.3619 605.5906 617.0181 656.9348 712.1121 723.9192 730.2230 756.6693 757.6190 862.2492 863.3671 877.0515 920.8660 965.7607 987.2710 1036.5861 1044.2038 1054.8653 1086.5914 1099.4873 1124.6710 1137.8465 1163.0681 1208.5878 1230.7046 1267.2403 1276.7878 1287.8742 1292.2236 1305.8151 1313.7116 1328.0522 1348.1103 1350.1461 1375.9469 1392.1076 1393.2433 1445.6494 1459.4781 1474.6111 1474.7531 1478.2388 1478.3593 1486.0858 1486.8216 1676.9221 1718.4834 2966.7181 2971.1637 2974.9826 2975.5162 2983.1313 2984.6978 3022.1428 3025.1033 3044.1054 3049.8384 3072.0550 3072.8673 3077.7982 3077.9893 3587.7682 3604.1975
redmass: 5.6658 3.0374 1.6959 2.2638 3.6745 2.1403 6.8402 2.7557 1.1626 1.1426 2.6872 3.2878 3.3481 3.9495 3.5718 6.2388 1.1671 3.6606 3.4694 7.6092 4.5882 1.2272 8.8720 2.3622 1.5367 2.4003 1.4210 1.2806 1.4917 2.1471 1.6658 3.0130 2.0648 2.9116 2.2506 2.7973 1.3905 2.8182 2.7387 2.8876 2.9870 2.3582 1.3075 1.3756 1.3488 1.3303 1.1186 2.0338 2.1760 1.9613 1.5120 1.5896 1.6008 1.2089 1.2226 1.0801 1.0991 1.0511 1.0520 1.0429 1.0432 1.0806 1.0825 8.2172 9.3961 1.0620 1.0595 1.0363 1.0385 1.0596 1.0595 1.0978 1.0984 1.1021 1.1008 1.1012 1.1012 1.0994 1.0993 1.0802 1.0799
irintensity: 0.0845 0.0916 0.0021 0.0838 0.7780 0.2355 3.2418 2.0473 0.0349 0.0197 0.3453 3.3264 0.0114 0.9000 0.0169 16.0473 126.2644 3.4306 12.5785 6.1191 7.5055 143.8080 43.7655 8.6389 3.3577 16.9677 17.2442 0.5472 1.7397 7.6327 2.2501 18.6297 2.1523 8.1128 6.2229 1.2136 0.1059 14.6939 14.3519 20.1643 0.0096 50.8054 0.3447 21.0601 4.0165 5.3969 0.8897 99.9068 54.1865 60.3440 0.0249 0.2834 1.1112 9.2745 10.5191 0.0263 10.1395 4.8564 2.4232 0.1088 26.0701 4.5150 21.0775 472.0793 388.2981 4.2009 11.0154 41.3444 41.9511 0.0586 81.1136 0.0335 0.9301 0.8020 9.7866 2.4760 134.8370 40.6195 45.0968 68.1722 36.1289
temp: 298.150 k
press: 1.00000 atm
elementType: 8 8 7 7 6 6 6 6 6 6 6 6 6 1 1 1 1 1 1 1 1 1 1 1 1 1 1 1 1
symmnumber: 1
zpe: 643148.1 jmol-1
zpe.correction: 0.244962 hartree
zpe.thermalcorrener: 0.259459 hartree
zpe.thermalcorrenthalpy: 0.260403 hartree
zpe.thermalcorrgfe: 0.203408 hartree
zpe.sumelectzpe: -611.529531 hartree
zpe.sumelectthermal: -611.515035 hartree
zpe.sumelectthermalent: -611.514090 hartree
zpe.sumelectthermalfe: -611.571086 hartree
dipole: 0.0003 -2.6349 -1.8808
dipole: 3.2373
quadrupole: -76.0320 -89.8944 -82.3665
quadrupole: 0.0020 -0.0012 10.0592
quadrupole: 6.7323 -7.1301 0.3978 0.0020 -0.0012 10.0592
hfenergy: -611.7744935 hartree
pointgroup: C01 [X(C9H16N2O2)]
dipole: 0.000591 1.0167938 -0.7670524 debye
polarizability: 111.7778255|-0.0275414|124.5870535|0.0148241|3.8786419|103.2432882 unknown
InChI: InChI=1S/C9H16N2O2/c1-3-5-9(6-4-2)7(12)10-8(13)11-9/h10-11H,3-6H2,1-2H3
charge 0 multiplicity 1
29 atoms
O  -0.00554 0.364696 2.305811
O  0.006552 -3.188124 -0.800053
N  0.004152 -0.816861 -1.062048
N  0.000082 -1.632031 1.021562
C  0.00054 0.391982 -0.206309
C  1.278443 1.263651 -0.400271
C  -1.278488 1.260484 -0.406873
C  -0.002234 -0.248404 1.211405
C  2.618357 0.523978 -0.195085
C  -2.617642 0.518009 -0.206945
C  0.003959 -2.013066 -0.361623
C  3.828702 1.429908 -0.506762
C  -3.828586 1.420717 -0.525558
H  1.210103 2.10831 0.312129
H  1.244189 1.698879 -1.420805
H  -1.240617 1.694679 -1.427719
H  -1.215334 2.106128 0.304852
H  0.006656 -0.799556 -2.080049
H  2.651707 -0.375416 -0.840362
H  2.687009 0.168773 0.851799
H  -2.690414 0.164122 0.8401
H  -2.645889 -0.382374 -0.851092
H  -0.000814 -2.323471 1.771737
H  3.807227 1.777888 -1.556991
H  3.836063 2.324381 0.14385
H  4.780892 0.891805 -0.350121
H  -3.84101 2.31606 0.123778
H  -3.802997 1.767299 -1.576155
H  -4.780265 0.880656 -0.372606
