program: Gaussian 09
title: 000234753
version: EM64L-G09RevD.01
frameworkgroup: C1[X(C8H14N2O2)]
method: RPBEPBE
basis: SDD
operation: Freq
keyword: #p
keyword: freq=noraman
keyword: PBEPBE/SDD
title: #p freq=noraman PBEPBE/SDD
converged: NO YES NO NO
title: Mulliken charges:
elementType: O O N N C C C C C C C C H H H H H H H H H H H H H H
charge: -0.215922 -0.232874 -0.447982 -0.406133 0.284522 -0.388857 -0.388236 0.112705 -0.354725 0.165858 -0.700808 -0.698689 0.194984 0.223646 0.230956 0.202119 0.315503 0.221680 0.209370 0.346164 0.236907 0.222535 0.221495 0.215540 0.207078 0.223164
chargesum: 0.00000
title: Mulliken charges with hydrogens summed into heavy atoms:
elementType: O O N N C C C C C C C C
charge: -0.215922 -0.232874 -0.132479 -0.059970 0.284522 0.029774 0.044839 0.112705 0.076325 0.165858 -0.019871 -0.052907
polarizability: 1.02391919e+02 -9.43130775e+00 1.10065997e+02 3.18386986e-01 -2.96775641e+00 9.40369498e+01
1716.lowfreq: -7.8457 -0.0003 -0.0001 0.0008 5.5005 13.9063 62.2147 72.7974 84.2191
frequency: 62.1424 72.7501 84.1858 96.8847 126.8148 159.9117 174.8920 228.7790 234.4284 265.9003 285.3554 313.6546 346.3359 382.3033 469.2405 519.8003 561.8437 602.1713 609.0690 649.7720 703.4030 717.6901 733.7151 749.9800 793.4509 862.6174 892.3699 947.7079 962.3384 989.7689 1029.3599 1050.6288 1076.7662 1092.4192 1118.7536 1138.3512 1166.7073 1212.0783 1241.5900 1280.4181 1285.9329 1304.5398 1313.4431 1315.4112 1330.2077 1348.6330 1374.8421 1393.2789 1397.4894 1446.4391 1462.1070 1475.1500 1479.0753 1483.0910 1485.5568 1486.7852 1675.7476 1717.5592 2971.3318 2977.1105 2982.7670 2985.6899 2988.2710 3024.8723 3044.1892 3050.9145 3074.4564 3080.0297 3084.7099 3087.9927 3589.3084 3605.3836
redmass: 5.8783 1.8697 2.5257 2.3373 3.2130 6.4389 2.3258 1.3162 1.2308 2.9578 2.1648 3.7796 4.2169 5.4495 1.1521 3.6444 3.4245 3.7796 8.7658 1.2250 5.1861 3.2318 2.7416 1.5153 1.4437 1.3935 2.2002 1.9052 2.8262 1.9927 2.4704 2.2863 1.5415 2.5649 2.8894 2.9175 2.8820 2.4035 1.2852 1.2762 1.2848 1.8497 2.3204 1.5935 1.8544 1.5633 1.6089 1.2113 1.2224 1.0807 1.0964 1.0516 1.0431 1.0416 1.0506 1.0810 8.2058 9.3835 1.0610 1.0369 1.0607 1.0600 1.0371 1.0983 1.1003 1.1004 1.1012 1.0994 1.0996 1.1005 1.0802 1.0799
irintensity: 0.1423 0.0524 0.2026 0.3326 0.8432 3.0453 0.8684 0.6252 0.7337 2.2337 1.3841 0.2215 2.8835 12.5219 120.1942 4.3140 11.4024 5.2792 9.8755 143.8820 11.4016 32.3939 12.5366 20.9320 11.7142 1.7569 6.8647 2.4622 13.1366 12.3992 10.3776 5.5500 0.5510 7.8170 14.1295 26.8942 0.8716 53.1171 6.0661 3.4726 10.8013 75.9143 64.3699 31.5473 47.4045 0.3496 0.5664 13.5815 10.0625 0.4819 13.0722 3.6169 14.0488 12.6274 8.0724 15.2972 478.2701 382.3732 8.3061 34.2308 10.2565 72.0218 19.6877 0.4685 0.3510 9.6717 64.4461 41.5888 36.0437 36.2289 67.9265 36.8700
temp: 298.150 k
press: 1.00000 atm
elementType: 8 8 7 7 6 6 6 6 6 6 6 6 1 1 1 1 1 1 1 1 1 1 1 1 1 1
symmnumber: 1
zpe: 570192.0 jmol-1
zpe.correction: 0.217175 hartree
zpe.thermalcorrener: 0.230222 hartree
zpe.thermalcorrenthalpy: 0.231167 hartree
zpe.thermalcorrgfe: 0.177845 hartree
zpe.sumelectzpe: -572.306391 hartree
zpe.sumelectthermal: -572.293343 hartree
zpe.sumelectthermalent: -572.292399 hartree
zpe.sumelectthermalfe: -572.345720 hartree
dipole: 1.3702 -2.0166 -2.1912
dipole: 3.2780
quadrupole: -72.9951 -82.1630 -73.0551
quadrupole: 5.7301 -3.0034 9.1263
quadrupole: 3.0760 -6.0920 3.0160 5.7301 -3.0034 9.1263
hfenergy: -572.5235653 hartree
pointgroup: C01 [X(C8H14N2O2)]
dipole: -0.5548014 0.7503066 -0.8901946 debye
dipolederiv: -0.4154766 0.1053252 0.0454984 0.1166254 -0.6735458 -0.259609 0.0828294 -0.3404363 -0.8701448 -0.5559108 0.3911382 0.0238188 0.4268594 -1.1790747 -0.1023291 0.0778477 -0.2023167 -0.5305696 -0.7539304 0.1815342 -0.1115486 0.1744618 -0.879209 0.2408393 -0.1344424 0.2721188 -0.5075025 -0.4794098 0.3047771 0.1849026 0.2758464 -1.0275554 -0.5011762 0.0747046 -0.282795 -0.7679268 0.2487176 -0.0301947 -0.1195645 -0.0658632 0.3940081 0.1165075 -0.1969671 0.2521972 -0.148897 0.0467646 -0.0293549 0.0862885 -0.048088 -0.0042296 -0.0042341 0.023128 -0.0142917 0.1284777 0.0181042 0.0252946 -0.0189223 0.0487873 0.0827512 -0.0810649 0.0248058 -0.0323146 0.1358576 0.4374763 -0.4781886 -0.0942028 -0.4412417 1.1840357 0.440295 0.0505836 0.1787172 0.9632117 -0.0215429 -0.0146018 -0.0092121 0.0448957 0.0787734 0.0326604 -0.0190055 0.0300604 0.1165761 0.666967 -0.6878443 0.097202 -0.7323835 1.6997675 0.1379579 0.0515392 0.2357956 1.3384377 -0.0811071 -0.0194955 -0.0029821 -0.0641114 0.0097905 0.026212 0.0147283 0.0212056 0.0532337 -0.0440444 -0.0070184 -0.0092183 -0.0532952 0.0672582 0.0070332 0.0069224 0.00996 0.1026478 0.01785 0.0107053 -0.0378931 -0.0066887 0.0523331 0.0500826 -0.0376594 0.0818869 -0.1467672 0.0392957 0.0465367 0.0015396 0.0238482 -0.07383 -0.0502269 0.0339807 -0.0932935 0.0394077 0.0108357 0.0496665 0.0518721 0.0693138 -0.0444975 -0.0345124 0.0552037 -0.0871439 0.0354931 0.0026541 -0.0122214 -0.0798313 -0.0123346 0.0475299 0.0326015 -0.0849605 0.0665983 -0.1328695 0.335855 0.0909142 -0.0298059 0.0976083 0.1874847 -0.0009981 -0.0250757 -0.0179009 0.1754643 0.0328828 0.004275 -0.0662783 0.0024694 0.0481963 0.0313933 -0.0560725 0.0594326 -0.1295056 0.0338148 0.0692792 0.047615 0.0474661 -0.0948325 -0.0624692 0.0366484 -0.0895447 0.0226704 0.3314383 0.0686815 -0.0085296 0.0746034 0.2084233 -0.0298161 0.0072407 -0.0587061 0.2033499 0.0526945 0.0231644 -0.0331042 0.0324814 0.0982298 0.0294396 -0.0834139 0.0123211 -0.1124684 0.0385689 0.0586542 0.0114307 0.1116403 -0.025811 -0.1094328 0.0376706 -0.0868289 0.0292761 0.0074504 -0.095125 0.0395807 -0.118309 -0.0952643 0.0879148 0.0504624 0.0876736 0.069313 0.0404638 0.0381749 0.0128481 0.1099802 -0.0792566 -0.1043766 0.0415802 -0.1063804 0.0230216 0.0507674 0.006858 -0.0124613 0.0359514 0.083139 0.0469084 -0.0849428 0.0407104 -0.1663132 -0.061179 -0.1009346 0.0309582 -0.150523 -0.0646143 0.0603997 0.0526641 0.0632749 0.0765261 unknown
polarizability: 102.7288646|-9.5640567|109.9315589|-0.0241779|2.3749078|93.8344422 unknown
InChI: InChI=1S/C8H14N2O2/c1-3-5-8(4-2)6(11)9-7(12)10-8/h9-10H,3-5H2,1-2H3
charge 0 multiplicity 1
26 atoms
O  0.203305 0.9783 2.114196
O  1.653443 -2.682025 -0.487625
N  0.532224 -0.651205 -1.044055
N  1.046894 -0.998736 1.105856
C  0.031657 0.561328 -0.356863
C  -1.512085 0.730577 -0.485938
C  0.75584 1.858437 -0.83347
C  0.417145 0.247195 1.117112
C  -2.350383 -0.483261 -0.028813
C  1.134806 -1.575319 -0.204982
C  2.293704 1.814899 -0.736497
C  -3.860323 -0.255727 -0.256702
H  -1.744165 0.967306 -1.545121
H  -1.793489 1.619049 0.111684
H  0.365473 2.691747 -0.219461
H  0.445014 2.054255 -1.879626
H  0.466164 -0.812234 -2.047139
H  -2.168202 -0.673815 1.047026
H  -2.023865 -1.390318 -0.573518
H  1.415219 -1.473685 1.930098
H  2.627503 1.720097 0.312324
H  2.713258 0.968675 -1.309234
H  2.728666 2.746172 -1.140492
H  -4.218469 0.62815 0.303202
H  -4.08207 -0.088145 -1.327686
H  -4.450563 -1.128014 0.076826
