program: Gaussian 09
title: 000234744
version: EM64L-G09RevD.01
frameworkgroup: C1[X(C8H6Cl3NO)]
method: RPBEPBE
basis: SDD
operation: Freq
keyword: #p
keyword: freq=noraman
keyword: PBEPBE/SDD
title: #p freq=noraman PBEPBE/SDD
converged: YES YES NO NO
title: Mulliken charges:
elementType: Cl Cl Cl O N C C C C C C C C H H H H H H
charge: -0.007551 -0.002086 -0.068157 -0.243617 -0.444311 0.537392 -0.446211 -0.349373 -0.030803 -0.179085 -0.119290 0.255342 -0.668523 0.260299 0.314765 0.327919 0.260222 0.301600 0.301467
chargesum: 0.00000
title: Mulliken charges with hydrogens summed into heavy atoms:
elementType: Cl Cl Cl O N C C C C C C C C
charge: -0.007551 -0.002086 -0.068157 -0.243617 -0.116392 0.537392 -0.185912 -0.034607 -0.030803 0.081137 -0.119290 0.255342 -0.065455
polarizability: 2.02398909e+02 -6.67762779e+00 1.37373702e+02 -6.74078979e-02 -7.39634688e-04 4.99402470e+01
1716.lowfreq: -6.3827 -2.5883 -2.2891 -0.0037 -0.0026 -0.0024 30.3354 58.1752 76.4200
frequency: 30.2483 58.1748 76.4158 83.2519 130.5276 167.5510 182.6390 199.6166 246.8590 327.3661 334.1875 386.2037 423.0413 439.5337 441.5026 547.4763 549.6296 589.1154 656.1511 682.9161 695.6610 727.2981 737.4880 836.2961 866.1491 871.9646 905.8994 958.4309 976.3216 999.0535 1122.3176 1147.1646 1150.5979 1210.5372 1240.8452 1258.2547 1287.8240 1360.8399 1393.1297 1419.3963 1467.1700 1525.3139 1586.2166 1603.0494 1609.8652 3070.8009 3148.6317 3152.9324 3166.1227 3200.8956 3453.8193
redmass: 10.8378 6.7944 3.5001 16.1199 5.0682 16.4109 23.9917 6.0516 13.1003 12.1251 5.5206 13.0269 8.0440 3.0918 7.3342 6.8919 3.6590 4.0057 7.1849 6.6311 3.1250 7.1487 1.1789 1.3259 6.0345 1.6208 1.7241 6.8228 1.3208 5.1702 2.2080 1.3306 1.1118 4.1440 1.4020 1.1912 2.1102 4.4528 4.8568 1.0938 2.9109 2.6351 4.3134 5.9971 6.2658 1.0565 1.0926 1.1094 1.0912 1.0955 1.0766
irintensity: 0.1752 0.8106 17.5742 0.0197 0.5264 6.4995 1.0388 1.1816 1.2049 11.1619 0.3470 1.3201 33.1383 8.7386 9.8887 2.6605 3.5432 8.1260 23.9235 64.5703 3.1418 18.4516 53.7690 22.7202 23.9289 65.7501 14.1957 9.4034 3.2036 24.8424 56.8022 2.6218 0.4412 18.5192 4.5202 15.9405 4.8166 96.2811 19.5194 24.9618 154.4529 370.9359 207.7830 82.6072 123.2638 2.9863 2.5455 0.4319 1.2290 7.4005 89.4157
temp: 298.150 k
press: 1.00000 atm
elementType: 17 17 17 8 7 6 6 6 6 6 6 6 6 1 1 1 1 1 1
symmnumber: 1
zpe: 327194.8 jmol-1
zpe.correction: 0.124622 hartree
zpe.thermalcorrener: 0.137189 hartree
zpe.thermalcorrenthalpy: 0.138133 hartree
zpe.thermalcorrgfe: 0.083140 hartree
zpe.sumelectzpe: -1817.680677 hartree
zpe.sumelectthermal: -1817.668110 hartree
zpe.sumelectthermalent: -1817.667166 hartree
zpe.sumelectthermalfe: -1817.722159 hartree
dipole: 2.4749 0.4702 0.0181
dipole: 2.5193
quadrupole: -98.8557 -98.7634 -97.2288
quadrupole: 3.4095 0.0405 -0.0512
quadrupole: -0.5731 -0.4808 1.0538 3.4095 0.0405 -0.0512
hfenergy: -1817.805299 hartree
pointgroup: C01 [X(C8H6Cl3N1O1)]
dipole: -0.9383592 -0.3184406 -0.0216246 debye
dipolederiv: -0.371183 0.2723711 -0.1047682 0.3542923 -0.3901668 0.127251 -0.1248506 0.1180167 -0.0757058 -0.7717357 -0.2036802 -0.0367131 -0.2312175 -0.1207856 -0.003596 -0.0304559 -0.0004902 -0.029075 -0.338148 -0.0603518 -0.0061232 -0.3272532 -0.6015479 0.0740296 0.0595713 0.1040283 -0.1713199 -0.803565 -0.183001 -0.006722 0.5601501 -0.8712597 0.1959498 -0.1919226 0.1110004 -0.3955226 -1.8580544 0.057415 -0.1943361 0.1830451 -0.4360894 0.0578223 -0.2246777 0.0437115 -0.3220408 1.2010166 0.1427202 0.0889474 0.3545928 0.1297368 0.0360938 0.0346146 0.0115096 0.1094602 -0.3906478 0.0725828 -0.0448695 0.1497679 -0.1255752 0.0110051 -0.0633939 0.0022946 -0.1577609 -0.233446 -0.0084088 -0.0054715 -0.1570681 -0.0941495 -0.0348427 0.0321059 -0.0183984 -0.1566793 0.4179042 -0.5117404 0.1742644 -0.577871 0.6028519 -0.2180431 0.1896242 -0.2105251 0.0499072 -0.1303041 -0.1111099 0.0202102 0.0393172 0.0641738 -0.0294515 -0.0162108 -0.0470052 -0.0651905 0.9014631 0.4731265 -0.0011929 0.387465 -0.0545754 0.0393279 0.0202677 0.0493893 -0.0858273 1.7132716 0.1136365 0.1457631 -1.0676313 0.8753333 -0.2940662 0.4372699 -0.1592389 0.2817067 -0.0564538 -0.0775832 -0.0037022 0.2944214 0.7446049 -0.1137947 -0.0945848 -0.1558606 0.1747123 0.0573689 -0.0650622 0.0023293 -0.063715 0.0008339 0.0352756 0.0024594 0.0351734 0.1676929 0.1477262 0.0582659 -0.0186871 0.0250065 0.1064039 0.0221167 -0.0099906 0.0264121 0.1786354 0.3287963 0.0919203 -0.018615 0.1397991 0.2107758 0.0364764 -0.0296865 0.0312826 0.2819575 0.0667985 -0.0306806 -0.0032064 -0.0393354 -0.0083899 0.036357 -0.0014325 0.0374075 0.1502157 0.0735284 -0.0271403 -0.0357892 -0.0351346 -0.0044068 0.0442778 -0.0716744 0.0183249 0.0072925 0.0456639 -0.0032799 0.0486821 0.0113686 -0.027768 -0.0221887 0.0829673 0.0029674 0.0575417 unknown
polarizability: 201.1723004|5.4671292|132.0011765|15.9773268|-19.473515|56.5393814 unknown
InChI: InChI=1S/C8H6Cl3NO/c9-4-8(13)12-5-1-2-6(10)7(11)3-5/h1-3,12H,4H2
charge 0 multiplicity 1
19 atoms
Cl 3.430802 -2.0390 0.797786
Cl 4.367012 1.057652 0.155742
Cl -3.870822 -2.398987 0.062561
O  -2.593465 1.389909 -0.73466
N  -1.460302 -0.585891 -0.112063
C  -0.105559 -0.154092 -0.065029
C  0.870457 -1.123562 0.282072
C  0.292582 1.180524 -0.344782
C  2.227796 -0.763239 0.350166
C  1.657135 1.521836 -0.271241
C  2.630043 0.561422 0.07466
C  -2.576977 0.159934 -0.425277
C  -3.930656 -0.558036 -0.398422
H  0.582598 -2.157577 0.500382
H  -0.456033 1.927271 -0.612793
H  -1.642669 -1.571432 0.114241
H  1.974945 2.546625 -0.484274
H  -4.391574 -0.510475 -1.395684
H  -4.584815 -0.080779 0.345614
