program: Gaussian 09
title: 000234739
version: EM64L-G09RevD.01
frameworkgroup: C1[X(C10H11Cl2N)]
method: RPBEPBE
basis: SDD
operation: Freq
keyword: #p
keyword: freq=noraman
keyword: PBEPBE/SDD
title: #p freq=noraman PBEPBE/SDD
converged: YES YES NO NO
title: Mulliken charges:
elementType: Cl Cl N C C C C C C C C C C H H H H H H H H H H H
charge: -0.021076 -0.009412 -0.049999 -0.112832 -0.694961 -0.692762 -0.235942 0.273807 -0.310333 -0.375367 -0.051678 -0.176253 -0.129074 0.241936 0.208036 0.232734 0.225439 0.231873 0.208994 0.224593 0.219847 0.271134 0.261518 0.259777
chargesum: 0.00000
title: Mulliken charges with hydrogens summed into heavy atoms:
elementType: Cl Cl N C C C C C C C C C C
charge: -0.021076 -0.009412 -0.049999 0.129105 -0.028752 -0.027302 -0.016094 0.273807 -0.039199 -0.113849 -0.051678 0.083524 -0.129074
polarizability: 2.25860841e+02 -2.41015752e+00 1.33757142e+02 2.16137937e+00 4.65086170e+00 7.26759350e+01
1716.lowfreq: -20.7712 -4.7813 -0.0028 -0.0021 -0.0015 4.7660 17.7051 52.1764 58.7775
frequency: 3.7795 52.1736 58.7711 97.4586 141.9488 181.5616 188.3136 197.6612 222.3189 237.7669 267.4340 315.0711 341.4159 382.8101 412.3578 426.3377 448.0450 477.3424 518.0394 590.7977 642.8606 677.2970 696.6696 820.2071 840.3319 853.5150 870.7150 921.1470 939.9045 948.5829 954.5481 974.0118 997.0595 1102.5580 1114.0674 1131.8201 1154.7798 1176.6572 1199.1635 1252.9546 1294.7554 1306.6584 1345.0200 1365.9099 1375.3799 1388.5923 1394.0313 1453.6909 1465.7875 1468.2287 1479.9903 1486.5246 1551.0905 1589.7111 1641.6221 2918.7837 2975.2353 2977.5855 3026.4166 3068.4992 3077.7553 3083.2053 3086.8335 3158.5839 3161.2200 3180.8697
redmass: 3.2703 5.0373 4.0178 4.0834 5.0603 21.0486 3.7789 1.0467 1.3911 4.3481 3.3453 3.9480 3.3885 3.1865 6.4473 3.4392 3.2968 5.5056 4.0903 4.9267 7.3122 7.6612 3.2186 1.3645 2.4438 2.6803 1.9821 1.1789 1.8556 1.3238 1.3628 1.8025 4.8421 2.5302 2.1208 1.3200 1.9402 3.2539 1.9841 1.3800 1.4147 1.3191 4.5316 1.4524 1.1909 4.8251 1.2251 2.6111 1.0508 1.0436 1.0580 1.0622 7.7477 7.2305 7.8344 1.0853 1.0353 1.0357 1.0857 1.0995 1.0981 1.1007 1.1000 1.0920 1.0884 1.0976
irintensity: 0.2439 0.1460 0.1081 1.6223 4.6559 0.0530 0.3833 0.0487 0.6217 2.0113 2.3195 10.0726 2.8386 2.3567 2.6687 6.6503 3.9722 8.6550 0.9763 6.3810 23.6569 8.8334 2.5620 35.6378 6.8114 52.4476 41.1623 4.8535 49.2499 3.2750 2.1919 9.3576 27.8113 5.9187 56.7917 0.7614 1.2356 2.6125 3.6208 0.5620 8.6262 0.3631 5.8493 9.3045 14.4794 8.2104 6.8425 116.1529 3.9586 3.7805 11.4136 15.4382 27.5067 19.1444 130.9214 42.9635 27.1922 37.4302 3.3375 3.1890 86.3803 21.7855 39.7440 0.9770 1.3951 3.0876
temp: 298.150 k
press: 1.00000 atm
elementType: 17 17 7 6 6 6 6 6 6 6 6 6 6 1 1 1 1 1 1 1 1 1 1 1
symmnumber: 1
zpe: 479416.8 jmol-1
zpe.correction: 0.182600 hartree
zpe.thermalcorrener: 0.196346 hartree
zpe.thermalcorrenthalpy: 0.197290 hartree
zpe.thermalcorrgfe: 0.138700 hartree
zpe.sumelectzpe: -1361.557122 hartree
zpe.sumelectthermal: -1361.543377 hartree
zpe.sumelectthermalent: -1361.542432 hartree
zpe.sumelectthermalfe: -1361.601022 hartree
dipole: -3.8104 -0.3823 0.7244
dipole: 3.8975
quadrupole: -87.6876 -87.4069 -93.9480
quadrupole: -6.2716 -2.3449 -0.5354
quadrupole: 1.9932 2.2739 -4.2671 -6.2716 -2.3449 -0.5354
hfenergy: -1361.7397225 hartree
pointgroup: C01 [X(C10H11Cl2N1)]
dipole: 1.499704 -0.2608814 -0.184601 debye
dipolederiv: -0.2397586 0.2041993 -0.0990582 0.3229627 -0.5216124 0.2184249 -0.1680755 0.2107025 -0.1388716 -0.8571823 -0.0465716 -0.05874 -0.0350845 -0.0631444 0.0095754 -0.0858438 0.0040094 -0.0402783 -1.0005186 -0.0545387 -0.0100863 -0.0276883 -0.3126093 0.0938583 0.1128728 0.1046276 -0.3649339 -0.1354024 -0.0443462 0.0425712 -0.0882715 0.0547177 0.0128761 0.1740313 -0.0039976 0.0728246 -0.116794 -0.0502915 0.0122156 0.1286912 -0.0058665 -0.0274098 -0.050982 -0.0446144 0.088237 -0.090142 0.0176648 0.0475941 -0.0534502 0.0154759 -0.054257 -0.119103 -0.0518623 0.0654494 0.9289902 0.1330788 -0.0656305 0.0989842 0.0062624 -0.251834 -0.0230841 -0.1868176 0.3690696 0.8804299 0.0307837 0.0440205 -0.0221192 0.1412299 -0.0200259 0.0052435 -0.047297 0.0793099 -0.3154648 0.0788165 -0.0287236 0.2356371 -0.1960379 0.0768315 0.0473629 0.0538049 -0.1469821 -0.2204873 -0.0030817 0.0305274 -0.1348563 0.0051035 -0.100179 -0.0569955 -0.071526 -0.1090707 0.1052904 -0.3594936 0.172747 -0.4466085 0.7736019 -0.3476048 0.2148284 -0.3598937 0.1330778 -0.126626 -0.037102 0.0167147 0.0821696 0.0301401 -0.0479096 0.00081 -0.0463488 -0.0716984 1.0643692 0.1657454 0.0614085 0.1144068 -0.1655482 0.0426298 0.090522 0.0586212 -0.0826092 0.0609456 -0.0039604 0.0068778 0.0250892 0.0041316 0.0641273 -0.0377561 0.057599 -0.0981671 0.1089378 0.0240751 -0.0587817 0.0106483 0.0250357 0.0522387 -0.0205102 0.1211991 -0.1131991 0.0771826 0.0757396 0.0931296 0.0546516 -0.0152816 -0.0851167 0.0730993 -0.104861 -0.0284402 -0.2122378 -0.0421522 -0.0489894 -0.0613272 0.0613089 0.0099297 -0.0450587 0.004615 0.0960526 0.1054337 -0.0806758 0.0063406 -0.0437665 -0.1453303 -0.036328 0.0044781 -0.008635 0.0766595 0.1028374 0.0387217 -0.0548382 0.012688 0.0365654 0.1176417 -0.004161 0.0495977 -0.1215314 -0.2292393 0.0139999 -0.0187431 0.0120066 0.0999648 -0.0178328 -0.0040768 -0.0127539 0.0629865 -0.0320995 0.01186 -0.058928 -0.095826 0.0908718 0.1328734 -0.0513118 0.1070861 -0.1374289 0.0410665 -0.0716524 0.0025255 -0.0687137 0.0384213 0.0367627 -0.0245921 0.0477659 0.1376832 0.0639084 0.0610517 -0.0486941 0.040629 0.02249 0.0667099 -0.040455 0.0667814 0.1303303 0.0365609 -0.0618701 0.0145407 -0.0608524 0.0201095 0.0540181 0.0087575 0.0521975 0.1415302 unknown
polarizability: 225.8207616|1.9157295|123.8232752|4.0403098|-22.933545|82.649881 unknown
InChI: InChI=1S/C10H11Cl2N/c1-7(2)6-13-8-3-4-9(11)10(12)5-8/h3-7H,1-2H3
charge 0 multiplicity 1
24 atoms
Cl -2.837665 2.177933 -1.1149
Cl -4.649478 -0.441609 -0.274601
N  1.356702 -0.519146 0.590407
C  3.707713 0.001028 0.05392
C  4.208299 1.470757 0.092011
C  4.480502 -0.821655 -1.011796
C  2.22597 -0.024103 -0.245236
C  -0.042544 -0.463439 0.332917
C  -0.677059 0.679864 -0.228835
C  -0.837228 -1.574988 0.721193
C  -2.072066 0.68963 -0.412141
C  -2.228994 -1.562974 0.515041
C  -2.852464 -0.429228 -0.052087
H  3.852286 -0.4594 1.048526
H  4.045387 1.973868 -0.880432
H  3.688809 2.052738 0.873873
H  5.292161 1.496743 0.306416
H  4.149713 -1.875257 -1.02252
H  4.33065 -0.402125 -2.024945
H  5.564075 -0.801874 -0.795279
H  1.92976 0.394452 -1.235224
H  -0.092639 1.56709 -0.491658
H  -0.34655 -2.438293 1.179088
H  -2.84184 -2.422513 0.801163
