program: Gaussian 09
title: 000234733
version: EM64L-G09RevD.01
frameworkgroup: C1[X(C12H16O)]
method: RPBEPBE
basis: SDD
operation: Freq
keyword: #pfreq=noraman
keyword: PBEPBE/SDD
title: #p freq=noraman PBEPBE/SDD
converged: YES YES NO NO
title: Mulliken charges:
elementType: O C C C C C C C C C C C C H H H H H H H H H H H H H H H H
charge: -0.276719 0.316115 -0.692290 -0.703994 -0.691778 -0.052907 -0.401784 0.482363 -0.399575 -0.403621 -0.238840 -0.227891 -0.256730 0.238177 0.216443 0.213854 0.231767 0.231979 0.199484 0.214501 0.216130 0.237897 0.212556 0.236281 0.224435 0.207503 0.221934 0.219309 0.225399
chargesum: 0.00000
title: Mulliken charges with hydrogens summed into heavy atoms:
elementType: O C C C C C C C C C C C C
charge: -0.276719 0.316115 -0.023815 -0.040763 -0.023250 0.159649 -0.165502 0.482363 -0.175140 -0.196118 -0.016906 -0.008582 -0.031331
polarizability: 2.36469719e+02 -6.86326515e-01 1.26714733e+02 1.07362111e-01 3.24585527e-02 7.78917591e+01
1716.lowfreq: -14.7779 -7.8668 -6.6816 -0.0002 0.0003 0.0004 18.6930 44.6521 69.4643
frequency: 13.7086 44.4623 69.4618 83.2846 137.9968 188.0114 197.9599 222.1557 234.0787 243.2288 277.8047 322.3221 328.6946 403.6489 416.7085 426.5680 430.8449 511.9153 522.7730 590.3453 616.7927 695.3811 729.8443 761.2428 810.0288 826.3033 842.7236 878.7451 901.5339 905.3303 918.3020 940.5401 947.5192 969.1202 985.8445 988.2342 1020.2021 1024.7258 1028.2965 1077.5641 1112.7092 1170.5643 1181.3326 1191.3079 1227.2151 1249.5074 1261.8042 1297.6358 1314.1360 1332.8120 1377.2584 1379.1305 1381.7244 1403.0143 1439.3854 1447.0627 1461.8732 1463.8150 1473.5827 1475.9514 1485.4836 1492.4398 1579.0673 1612.4436 1658.5148 2986.0488 2988.7383 2995.8317 3078.8455 3083.1308 3092.6583 3093.6920 3099.1760 3102.0678 3102.7669 3114.9791 3116.6584 3120.2504 3133.1302 3141.6223 3161.5448
redmass: 3.2984 3.2041 3.9355 3.1321 1.2154 1.6122 3.0901 1.1559 1.1089 3.0947 4.1960 2.7500 2.6485 2.8047 3.0187 2.6992 2.7995 2.9460 3.4206 5.2995 6.4227 1.6881 5.1683 1.7929 3.3756 1.7904 1.3289 4.0908 1.4083 1.5962 1.5847 1.1957 1.1994 1.3867 6.1179 1.3134 1.4199 1.8297 1.6256 1.9133 3.6334 1.0614 2.0867 1.1167 1.7046 3.0537 2.9575 2.0167 1.3307 1.3010 1.2290 1.4092 3.7359 1.2078 2.3811 1.0488 1.0498 1.0478 1.0618 1.0624 2.3418 1.0537 5.6819 6.0303 5.6036 1.0355 1.0355 1.0358 1.0994 1.0985 1.1008 1.0995 1.0970 1.0955 1.1000 1.0847 1.0876 1.0873 1.0912 1.0962 1.1014
irintensity: 0.3479 1.0944 0.2202 0.1097 0.2366 0.7024 0.5690 0.1502 0.0063 0.4729 0.1788 0.6091 1.7297 0.0008 0.2951 0.2831 2.3506 16.3804 7.7306 5.3565 0.0666 46.6451 20.8600 52.5532 15.8463 0.8132 0.0955 29.7149 1.3335 0.2729 1.4998 61.9545 7.9850 0.9361 3.3936 2.4567 1.0562 18.1980 1.2672 100.0879 508.0457 4.6560 142.0956 1.1633 44.5363 33.3027 52.0345 2.3646 6.2435 4.4480 33.2495 26.1239 12.5742 18.9989 10.2114 1.0864 0.0928 0.8233 5.8560 12.8111 14.0606 14.9316 4.1739 51.3219 255.8901 17.2233 17.6615 19.5138 1.2354 53.1775 4.9519 2.5203 64.1542 45.4673 36.6089 6.6916 2.9448 25.0385 8.4615 59.7807 27.7505
temp: 298.150 k
press: 1.00000 atm
elementType: 8 6 6 6 6 6 6 6 6 6 6 6 6 1 1 1 1 1 1 1 1 1 1 1 1 1 1 1 1
symmnumber: 1
zpe: 642485.3 jmol-1
zpe.correction: 0.244710 hartree
zpe.thermalcorrener: 0.258646 hartree
zpe.thermalcorrenthalpy: 0.259590 hartree
zpe.thermalcorrgfe: 0.202737 hartree
zpe.sumelectzpe: -541.100826 hartree
zpe.sumelectthermal: -541.086890 hartree
zpe.sumelectthermalent: -541.085946 hartree
zpe.sumelectthermalfe: -541.142799 hartree
dipole: -2.4704 1.6045 0.0231
dipole: 2.9458
quadrupole: -67.1443 -73.8809 -83.6306
quadrupole: -3.6603 -0.0298 -0.0048
quadrupole: 7.7409 1.0044 -8.7453 -3.6603 -0.0298 -0.0048
hfenergy: -541.3455358 hartree
pointgroup: C01 [X(C12H16O1)]
dipole: -0.9453739 0.6498897 0.1645628 debye
polarizability: 235.898264|-3.5862246|125.5076588|-8.21064|8.2029133|79.6702883 unknown
InChI: InChI=1S/C12H16O/c1-12(2,3)13-10-9-11-7-5-4-6-8-11/h4-10H,1-3H3
charge 0 multiplicity 1
29 atoms
O  -2.127788 -0.667642 0.015743
C  -3.332691 0.219058 0.237292
C  -3.38675 1.302802 -0.861297
C  -4.501529 -0.770546 0.100964
C  -3.2742 0.82363 1.65696
C  -0.860412 -0.089813 0.063717
C  0.253243 -0.853647 -0.130245
C  1.64657 -0.381926 -0.112473
C  2.691849 -1.330658 -0.317666
C  2.024053 0.979566 0.09626
C  4.048181 -0.943455 -0.314715
C  3.378812 1.366092 0.099278
C  4.402933 0.409268 -0.106066
H  -3.362802 0.83488 -1.860718
H  -4.321306 1.885397 -0.769967
H  -2.542276 2.011505 -0.789701
H  -4.416459 -1.568949 0.857754
H  -4.4916 -1.239244 -0.897872
H  -5.465922 -0.250499 0.239805
H  -2.420967 1.51441 1.779326
H  -4.19891 1.392323 1.863205
H  -3.181458 0.021388 2.409359
H  -0.812122 0.989137 0.262483
H  0.095057 -1.923779 -0.31787
H  2.427928 -2.383165 -0.480835
H  1.255069 1.744798 0.255495
H  4.828363 -1.696501 -0.475415
H  3.641479 2.418242 0.261305
H  5.455153 0.714326 -0.103707
