program: Gaussian 09
title: 000234729
version: EM64L-G09RevD.01
frameworkgroup: C1[X(C16H18N2O7)]
method: RPBEPBE
basis: SDD
operation: Freq
keyword: #p
keyword: freq=noraman
keyword: PBEPBE/SDD
title: #p freq=noraman PBEPBE/SDD
converged: YES YES NO NO
title: Mulliken charges:
elementType: O O O O O O O N N C C C C C C C C C C C C C C C C H H H H H H H H H H H H H H H H H H
charge: -0.382621 -0.444853 -0.216034 -0.189755 -0.212029 -0.262316 -0.248877 -0.461577 -0.447850 0.204178 -0.425247 -0.530482 0.160408 0.101832 0.106725 0.312193 0.263500 -0.342820 -0.343529 -0.784960 0.477328 -0.452077 -0.365324 0.224602 -0.779532 0.287511 0.275526 0.249978 0.241785 0.355804 0.280050 0.245104 0.216851 0.255871 0.260680 0.223717 0.310270 0.390949 0.398548 0.307292 0.215224 0.261491 0.262465
chargesum: 0.00000
title: Mulliken charges with hydrogens summed into heavy atoms:
elementType: O O O O O O O N N C C C C C C C C C C C C C C C C
charge: 0.008328 -0.046305 -0.216034 -0.189755 -0.212029 -0.262316 -0.248877 -0.105774 -0.140558 0.204178 0.137790 -0.038718 0.160408 0.101832 0.106725 0.312193 0.263500 -0.062770 -0.098425 -0.051557 0.477328 -0.228359 -0.055054 0.224602 -0.040352
polarizability: 3.08244031e+02 -2.88443934e+01 2.08532811e+02 5.53485162e+00 -1.38950879e+01 1.53541953e+02
1716.lowfreq: -1.5362 -0.0002 0.0009 0.0010 2.5895 5.0677 12.4684 23.2145 32.1988
frequency: 12.4358 23.1928 32.1654 39.4290 46.2846 51.1416 58.2505 60.6697 66.2877 78.3551 92.9855 97.7783 108.3950 120.6963 126.5047 144.6714 156.3185 174.1465 194.4853 244.2817 258.1413 286.9830 300.6138 311.6213 344.3721 347.0262 362.4048 384.0487 409.7757 420.3681 483.1595 492.4423 494.1841 513.5282 538.6021 550.8646 574.2241 576.3357 591.1240 598.3887 607.0136 622.7844 629.3154 635.2523 655.8167 662.1375 680.7860 706.3855 740.5105 751.8359 788.5647 820.8521 835.3381 845.2364 862.8847 893.9218 929.7370 957.7025 967.8293 983.4768 989.5645 992.9288 997.1572 1006.7647 1018.0105 1033.0648 1040.6435 1042.9551 1052.1725 1083.2193 1098.4689 1122.4438 1146.2159 1185.3854 1200.9911 1216.8928 1223.6183 1259.6432 1265.7438 1282.1223 1298.1553 1305.4173 1309.8603 1312.0002 1355.5241 1368.0044 1387.3648 1390.6859 1423.0680 1438.6246 1448.2553 1449.0822 1459.1408 1463.5825 1470.0775 1475.6710 1483.3717 1510.4762 1572.0175 1593.6399 1610.0314 1621.7510 1631.6095 1647.6417 1671.8601 2963.7626 2997.1061 2998.6170 3016.9933 3057.4770 3095.6655 3097.4464 3101.5045 3109.2085 3113.6361 3125.1831 3146.6079 3161.0626 3197.1238 3517.0852 3525.3704 3530.0889 3544.2100
redmass: 7.1749 4.4593 7.3217 6.9018 3.1003 1.6586 2.5405 3.0179 1.9102 3.4020 5.5235 3.9456 5.2389 3.5388 7.2038 4.7213 3.4812 5.3068 5.7828 4.7320 5.2446 6.0606 4.5509 4.5100 4.9015 4.3256 5.4165 7.6710 2.9295 4.6729 4.3699 3.0122 3.0678 3.2881 3.1715 3.7609 2.2078 2.0827 1.6304 2.9104 1.6188 2.4404 6.1593 2.3806 1.1897 3.8496 4.7232 3.7168 3.0450 6.2579 1.9378 3.7140 4.6917 1.3320 1.6584 4.2557 6.3051 5.1189 3.0845 2.4665 1.4112 1.6792 1.3460 2.5529 2.2264 3.1708 1.6369 1.6614 2.7468 2.1122 2.8558 1.3487 2.5646 1.2008 1.7655 3.2945 1.9413 1.9169 1.8787 1.8213 1.7561 1.8580 1.6599 1.5209 1.7979 3.8756 1.2298 1.2149 4.4706 1.1134 1.0971 1.0458 1.1234 1.1791 1.0938 1.5530 2.1673 2.8283 5.6068 7.4709 6.6599 5.3112 5.6493 10.3518 9.7827 1.0602 1.0363 1.0361 1.0970 1.0606 1.0988 1.0992 1.0993 1.1000 1.0900 1.1036 1.0902 1.0945 1.0947 1.0641 1.0645 1.0765 1.0785
irintensity: 0.5389 2.4877 7.6330 4.0444 3.3415 1.3815 2.6626 6.6358 0.1740 3.4114 0.1555 0.0597 12.6743 4.6022 4.7849 1.6482 1.0347 2.6716 1.6411 4.6943 3.3021 1.6702 0.1972 1.7317 2.8968 1.9645 12.5176 3.5554 0.0119 0.5878 27.0915 14.6367 3.4183 2.3953 71.1734 8.7195 15.3590 136.6770 15.3558 4.2211 193.3897 107.6046 5.6877 43.9704 54.1137 22.1040 4.4071 32.8685 3.6011 6.7310 42.4235 7.4191 2.5392 15.2637 40.4686 3.3531 0.5724 50.2584 41.1287 103.6779 1.6467 17.3930 4.7940 1.7206 51.6377 127.0653 14.9447 16.3261 147.1039 60.1827 9.8689 24.4943 14.9459 132.4649 9.7954 86.4479 128.4573 85.3722 47.9299 23.3018 115.4453 26.5357 21.2633 101.0361 105.9051 101.1296 62.7791 64.4249 18.4782 14.0819 59.8122 16.4101 64.2453 109.2734 20.8069 144.5519 338.2764 234.1326 30.9789 206.4209 148.6360 63.3033 121.7446 270.3255 165.8562 30.3893 11.3478 8.1508 11.5973 0.7288 11.8270 12.4033 11.6443 11.4279 20.3380 1.0894 11.6614 4.7054 5.4402 41.9635 37.3756 15.0914 65.1533
temp: 298.150 k
press: 1.00000 atm
elementType: 8 8 8 8 8 8 8 7 7 6 6 6 6 6 6 6 6 6 6 6 6 6 6 6 6 1 1 1 1 1 1 1 1 1 1 1 1 1 1 1 1 1 1
symmnumber: 1
zpe: 852920.3 jmol-1
zpe.correction: 0.324860 hartree
zpe.thermalcorrener: 0.350869 hartree
zpe.thermalcorrenthalpy: 0.351813 hartree
zpe.thermalcorrgfe: 0.264345 hartree
zpe.sumelectzpe: -1254.773022 hartree
zpe.sumelectthermal: -1254.747013 hartree
zpe.sumelectthermalent: -1254.746069 hartree
zpe.sumelectthermalfe: -1254.833537 hartree
dipole: 6.0086 -2.3563 0.8232
dipole: 6.5064
quadrupole: -116.7516 -144.0594 -149.5479
quadrupole: 21.9579 -13.7344 0.1391
quadrupole: 20.0347 -7.2731 -12.7616 21.9579 -13.7344 0.1391
hfenergy: -1255.0978819 hartree
pointgroup: C01 [X(C16H18N2O7)]
dipole: -2.3672895 0.8864791 0.4034876 debye
polarizability: 308.4396612|-27.930417|205.3912168|-7.9800655|18.5773722|156.4879175 unknown
InChI: InChI=1S/C16H18N2O7/c1-9(19)17-12-5-3-11(4-6-12)13(21)7-8-16(14(22)23,15(24)25)18-10(2)20/h3-6,17-18,22,24H,7-8H2,1-2H3
charge 0 multiplicity 1
43 atoms
O  4.788266 -1.817755 0.230745
O  2.887431 1.760624 2.222026
O  5.775916 0.280103 0.341517
O  3.138269 -0.458673 2.855654
O  0.097587 -2.494556 -0.866391
O  3.978994 0.371861 -2.254657
O  -5.996144 2.000598 0.807003
N  3.207424 1.371387 -0.313004
N  -5.878221 -0.134373 -0.166731
C  3.2952 0.115946 0.449652
C  2.224327 -0.931524 0.012952
C  0.791379 -0.39785 0.170339
C  4.756132 -0.435978 0.307705
C  3.112898 0.400705 1.956899
C  -0.253893 -1.384348 -0.366489
C  -1.701581 -1.006244 -0.286749
C  3.596198 1.416293 -1.643195
C  -2.671795 -1.92514 -0.775029
C  -2.154572 0.227715 0.251862
C  3.548257 2.787365 -2.301458
C  -4.479684 -0.377297 -0.183315
C  -4.037673 -1.619185 -0.725301
C  -3.522862 0.552198 0.309481
C  -6.568326 0.991979 0.302283
C  -8.085555 0.914673 0.152928
H  2.423047 -1.19748 -1.037078
H  2.364951 -1.846305 0.609346
H  0.679217 0.567091 -0.36411
H  0.554902 -0.191648 1.235261
H  3.036546 2.230232 0.214096
H  -2.318607 -2.874794 -1.189854
H  -1.434438 0.957495 0.636224
H  3.038859 3.550192 -1.688177
H  3.035746 2.703778 -3.274151
H  4.580901 3.124124 -2.501502
H  -4.772734 -2.339988 -1.106669
H  -3.866735 1.501012 0.723775
H  5.733038 -2.122097 0.155543
H  2.798108 1.901515 3.202761
H  -6.4551 -0.885411 -0.55275
H  -8.450447 -0.040222 -0.263515
H  -8.423517 1.738191 -0.499821
H  -8.549812 1.07239 1.141297
