program: Gaussian 09
title: 000234725
version: EM64L-G09RevD.01
frameworkgroup: C1[X(C14H14BrNO6)]
method: RPBEPBE
basis: SDD
operation: Freq
keyword: #p
keyword: freq=noraman
keyword: PBEPBE/SDD
title: #p freq=noraman PBEPBE/SDD
converged: YES YES NO NO
title: Mulliken charges:
elementType: Br O O O O O O N C C C C C C C C C C C C C C H H H H H H H H H H H H H H
charge: 0.030292 -0.383057 -0.444237 -0.213386 -0.188387 -0.202831 -0.261189 -0.463078 0.202269 -0.425242 -0.533052 0.162468 0.099857 0.122658 0.295678 0.263568 -0.331174 -0.338787 -0.784224 -0.200051 -0.189147 -0.210137 0.289104 0.277677 0.242401 0.251736 0.355729 0.250676 0.286098 0.255958 0.216324 0.262283 0.392381 0.399251 0.253678 0.257894
chargesum: 0.00000
title: Mulliken charges with hydrogens summed into heavy atoms:
elementType: Br O O O O O O N C C C C C C C C C C C C C C
charge: 0.030292 0.009324 -0.044986 -0.213386 -0.188387 -0.202831 -0.261189 -0.107349 0.202269 0.141539 -0.038915 0.162468 0.099857 0.122658 0.295678 0.263568 -0.080499 -0.052689 -0.049659 0.053627 0.068747 -0.210137
polarizability: 2.70644908e+02 -1.42083037e+01 1.60793593e+02 -1.47235389e+01 2.45489665e+01 1.57674123e+02
1716.lowfreq: -5.0860 -1.7066 -0.0002 0.0005 0.0007 5.3667 11.8433 21.8949 28.2344
frequency: 11.4781 21.7876 28.2204 39.9250 46.8546 52.2158 64.9494 74.4986 95.2248 99.1299 110.1580 121.2706 125.5363 152.2571 175.6682 216.6764 239.5555 251.4846 269.3021 288.3204 313.3887 346.8855 356.7973 384.6051 405.8121 434.5012 456.5593 491.3044 495.0786 517.5836 538.3786 568.3745 575.4874 595.6354 610.1441 620.8329 624.1974 635.5743 662.4315 685.8066 707.3508 719.0285 756.6058 783.4007 821.4262 834.7692 852.9874 893.1212 954.7598 961.3768 971.8220 982.5140 997.0520 998.2315 1015.7956 1030.8265 1042.6966 1049.4503 1059.1495 1083.3145 1098.9949 1111.8481 1147.7918 1186.4901 1201.8389 1213.7483 1259.4139 1282.0291 1293.7372 1299.3043 1303.5341 1309.8303 1354.7639 1368.9376 1388.0535 1394.1421 1434.9024 1448.7894 1457.3242 1463.2890 1470.3227 1475.3888 1560.7405 1586.2078 1604.7445 1610.4709 1649.5015 1672.0045 2960.7118 2998.6615 3013.5871 3057.9295 3096.9464 3106.9615 3126.0130 3149.8492 3153.9067 3172.2914 3176.0170 3516.2741 3525.8412 3543.9191
redmass: 8.5919 4.2276 8.6354 6.8279 3.4905 2.0827 2.9208 8.5335 7.7651 3.4264 5.9617 3.5920 6.2185 4.1398 8.6120 6.2163 4.9128 4.6237 8.9743 5.6579 4.7997 4.1490 5.3174 7.9599 2.8662 5.6908 3.3261 5.0785 3.2945 3.1096 3.2489 2.2610 2.0018 1.7472 1.6066 6.7174 2.3777 2.1420 3.6454 5.0915 3.6168 3.5549 5.9434 1.7482 2.5899 1.6049 1.4482 4.5180 5.2990 1.7409 2.3353 2.4127 3.8574 1.3734 2.3666 3.0915 1.6656 2.7649 2.6064 2.1606 2.6862 1.4190 2.5179 1.1411 1.8076 2.1943 1.9329 1.8641 1.3890 1.5980 2.0044 1.5465 1.7656 4.3357 1.2305 3.8534 1.1194 1.0766 1.1133 1.1966 2.2653 1.5599 7.6670 6.4214 8.0956 6.6211 10.4362 9.7927 1.0600 1.0361 1.0972 1.0606 1.0988 1.1000 1.1036 1.0881 1.0889 1.0961 1.0973 1.0641 1.0645 1.0783
irintensity: 0.1867 0.7264 8.4444 0.5835 0.7494 3.5687 0.9873 3.4330 0.1911 1.8229 8.4839 1.9777 6.0373 0.4278 0.3939 5.3352 0.5195 0.8794 0.5032 4.4484 12.1804 1.0573 8.5383 3.3215 0.0434 1.5048 13.3406 26.4654 2.8668 7.8795 69.6090 10.4817 135.2969 20.0989 165.8503 0.7701 106.0754 39.0252 40.3730 16.0672 40.5792 2.4682 6.0181 52.8381 12.7738 1.6488 21.4466 1.9263 56.3196 12.2646 46.8188 100.8949 24.3616 2.7959 23.2588 174.8513 17.5630 139.0970 51.5904 63.1364 4.3146 8.6797 16.6099 34.8898 9.5061 85.7021 90.5284 23.7347 32.2089 104.7969 19.6605 5.1387 17.2399 29.9936 66.2339 27.8726 8.9561 43.9977 51.0215 118.4245 16.3159 147.3381 91.5502 150.7699 26.4401 149.6511 278.8245 158.7678 32.2690 8.1929 11.2408 0.7029 10.8048 11.9841 0.8185 6.7736 0.5190 8.1960 1.6840 42.9706 38.8516 66.2602
temp: 298.150 k
press: 1.00000 atm
elementType: 35 8 8 8 8 8 8 7 6 6 6 6 6 6 6 6 6 6 6 6 6 6 1 1 1 1 1 1 1 1 1 1 1 1 1 1
symmnumber: 1
zpe: 685260.6 jmol-1
zpe.correction: 0.261002 hartree
zpe.thermalcorrener: 0.283738 hartree
zpe.thermalcorrenthalpy: 0.284683 hartree
zpe.thermalcorrgfe: 0.203806 hartree
zpe.sumelectzpe: -1059.850545 hartree
zpe.sumelectthermal: -1059.827809 hartree
zpe.sumelectthermalent: -1059.826864 hartree
zpe.sumelectthermalfe: -1059.907741 hartree
dipole: -1.1184 3.1504 4.3481
dipole: 5.4847
quadrupole: -150.0699 -132.4369 -134.5381
quadrupole: 2.7905 9.9992 7.1361
quadrupole: -11.0549 6.5781 4.4768 2.7905 9.9992 7.1361
hfenergy: -1060.1115471 hartree
pointgroup: C01 [X(C14H14Br1N1O6)]
dipole: -0.3412711 0.7033212 2.0112717 debye
polarizability: 268.4130088|-12.7798684|147.6679967|-21.0659742|22.3771436|173.0316181 unknown
InChI: InChI=1S/C14H14BrNO6/c1-8(17)16-14(12(19)20,13(21)22)7-6-11(18)9-2-4-10(15)5-3-9/h2-5,16,19,21H,6-7H2,1H3
charge 0 multiplicity 1
36 atoms
Br -7.229986 0.656931 0.834575
O  3.624909 -1.662545 -1.313703
O  2.302099 -0.311519 2.755002
O  4.871241 -0.266134 0.060679
O  2.18381 -2.356314 1.662076
O  -1.133245 -1.058299 -2.094646
O  2.99999 1.710408 -1.554108
N  2.446452 1.142897 0.622607
C  2.393434 -0.292608 0.3047
C  1.192817 -0.665677 -0.617816
C  -0.159526 -0.277499 0.00093
C  3.770307 -0.70008 -0.329538
C  2.286934 -1.118197 1.606242
C  -1.329323 -0.567345 -0.945442
C  -2.725837 -0.257546 -0.479143
C  2.791808 2.066377 -0.353798
C  -3.005739 0.310423 0.792263
C  -3.807822 -0.548459 -1.353425
C  2.912511 3.510066 0.110988
C  -4.33275 0.583512 1.186385
C  -5.137917 -0.283194 -0.976141
C  -5.384285 0.281967 0.295068
H  1.33644 -0.153086 -1.581838
H  1.229647 -1.747611 -0.81864
H  -0.340311 -0.826993 0.948807
H  -0.169003 0.800617 0.260939
H  2.434505 1.405531 1.610431
H  -2.194471 0.546982 1.487885
H  -3.579443 -0.98546 -2.331061
H  2.326995 4.157348 -0.563168
H  2.57241 3.66757 1.148807
H  3.968377 3.823228 0.031548
H  4.519424 -1.901255 -1.679481
H  2.266805 -0.88369 3.568082
H  -4.544976 1.021265 2.165726
H  -5.96628 -0.509909 -1.652996
