program: Gaussian 09
title: 000234716
version: EM64L-G09RevD.01
frameworkgroup: C1[X(C14H18N4O4S)]
method: RPBEPBE
basis: SDD
operation: Freq
keyword: #p
keyword: freq=noraman
keyword: PBEPBE/SDD
title: #p freq=noraman PBEPBE/SDD
converged: YES YES NO NO
title: Mulliken charges:
elementType: S O O O O N N N N C C C C C C C C C C C C C C H H H H H H H H H H H H H H H H H H
charge: 0.988457 -0.280575 -0.267635 -0.495332 -0.545486 -0.618757 -0.087430 -0.057688 -0.688335 -0.086803 0.259811 0.019211 -0.089359 -0.411812 0.247022 -0.147400 -0.224146 -0.413507 -0.391770 0.516019 -0.776475 -0.498947 -0.508947 0.356776 0.200095 0.276371 0.283070 0.283242 0.229743 0.230662 0.240331 0.230583 0.249482 0.314598 0.314554 0.200834 0.244313 0.234110 0.241761 0.229337 0.200023
chargesum: 0.00000
title: Mulliken charges with hydrogens summed into heavy atoms:
elementType: S O O O O N N N N C C C C C C C C C C C C C C
charge: 0.988457 -0.280575 -0.267635 -0.495332 -0.545486 -0.261982 -0.087430 -0.057688 -0.059183 -0.086803 0.259811 0.019211 0.110736 -0.135441 0.247022 0.135670 0.059095 -0.183765 -0.161108 0.516019 -0.056079 0.180310 0.162175
polarizability: 2.95056551e+02 -1.57207658e+01 2.25218814e+02 -2.31030006e+01 -1.47977771e+01 1.80765709e+02
1716.lowfreq: -0.0015 -0.0014 0.0012 0.1886 2.3777 8.1151 15.5703 23.4958 29.4106
frequency: 15.3751 23.4917 29.3052 49.6429 62.3240 71.2296 76.3160 84.2091 91.6334 106.1187 130.7229 139.1026 150.9014 160.6669 176.2188 186.7448 201.1106 214.8284 228.5086 245.7715 261.0096 280.5811 295.1554 322.5872 347.3620 353.2306 381.9918 405.7616 412.3213 413.3298 414.7777 432.0037 454.1492 514.3945 522.2943 535.3051 538.1150 585.8590 599.6903 622.3483 627.2251 658.1928 702.6067 720.6058 745.0041 792.5611 801.2979 811.4642 816.2599 834.0970 849.9143 900.3439 906.9557 940.9911 947.2992 948.5978 964.2643 969.9159 981.6603 987.2472 1002.2754 1022.4787 1047.9559 1053.2476 1059.2168 1081.0190 1112.2920 1115.8256 1132.5433 1143.3079 1159.1294 1164.9315 1185.3560 1210.2757 1276.0599 1303.5844 1318.3334 1322.6531 1323.4535 1356.4625 1387.1513 1396.3995 1401.7896 1425.2829 1430.9005 1435.9352 1440.3164 1452.4768 1455.3428 1457.2455 1464.6925 1477.6345 1480.3936 1490.4922 1529.6658 1561.2150 1587.4203 1614.0067 1648.4251 2907.1867 2946.0476 2957.4378 2990.1071 3039.6989 3066.0361 3074.5013 3108.8153 3109.1405 3125.8234 3134.5355 3136.9285 3165.2234 3182.0084 3202.6073 3510.1107 3563.2552 3702.2263
redmass: 5.8472 4.1167 4.4178 3.8862 4.2895 4.3887 4.2197 1.1249 2.7558 3.1849 1.7717 7.2548 3.1387 1.3597 2.9117 3.3192 7.0936 4.3854 8.1726 7.4581 3.8615 4.2651 6.0203 5.6194 4.5108 4.8036 4.3113 3.5507 1.1743 3.4169 3.2309 1.3727 5.8619 2.5604 2.6079 2.4028 4.2746 3.8725 6.1659 6.8597 6.5851 5.3622 3.1148 2.9395 4.7643 5.6480 6.1138 1.2982 8.2412 1.8277 3.9048 1.6255 5.0892 6.9900 1.7407 3.4928 1.4415 4.1254 5.0931 2.2789 9.1860 1.4429 1.6176 2.5263 3.1421 2.6020 1.2690 1.2577 1.1968 1.3506 1.6683 1.7371 1.1168 1.9545 2.7956 1.2871 1.6110 1.8192 1.3830 5.5098 1.6829 1.9591 5.6828 1.1676 1.2481 3.6606 3.9123 1.0760 1.0529 1.0510 1.1804 1.0585 1.0536 2.9067 5.9481 6.1095 7.4389 4.8061 1.2254 1.0838 1.0358 1.0380 1.0370 1.0983 1.0947 1.0971 1.1001 1.1007 1.1027 1.0898 1.0897 1.0958 1.0948 1.0937 1.0773 1.0452 1.1040
irintensity: 1.6710 2.1200 0.8489 0.8562 1.4876 1.1987 2.3290 1.1265 4.7362 3.2881 0.2862 0.3337 6.2200 0.3585 6.3560 5.0653 3.5718 13.5142 8.9084 1.5320 0.7737 14.2547 21.1983 4.6805 6.1789 4.9786 5.4920 8.9919 5.4102 24.1216 5.7445 217.9973 302.6875 30.0844 55.6544 44.4457 11.8012 5.7975 10.9770 4.8972 51.9786 3.6783 90.1344 1.2586 182.6206 3.8808 47.6221 1.8572 96.5351 81.3319 86.9513 0.8770 11.7742 11.2279 12.6534 36.6938 0.5970 26.7513 7.9357 26.7878 117.9640 1.3846 12.2223 74.5442 78.2153 66.5469 1.4031 0.5406 11.8948 10.0138 43.9574 14.0304 46.9202 2.6691 13.6226 4.3581 93.8738 37.0590 17.9509 115.6626 25.5255 34.0193 5.5288 2.2154 30.9250 7.3768 425.2857 42.5453 10.8547 19.1717 73.9463 10.2241 13.4202 71.6807 308.8660 167.1837 12.7110 171.6255 267.0128 45.4618 59.9568 91.8658 10.6277 49.8442 40.2068 10.9036 18.2657 32.4966 20.6871 13.6771 14.7315 6.4658 4.7078 0.7029 71.0933 111.5817 24.8997
temp: 298.150 k
press: 1.00000 atm
elementType: 16 8 8 8 8 7 7 7 7 6 6 6 6 6 6 6 6 6 6 6 6 6 6 1 1 1 1 1 1 1 1 1 1 1 1 1 1 1 1 1 1
symmnumber: 1
zpe: 816402.7 jmol-1
zpe.correction: 0.310951 hartree
zpe.thermalcorrener: 0.335580 hartree
zpe.thermalcorrenthalpy: 0.336524 hartree
zpe.thermalcorrgfe: 0.254320 hartree
zpe.sumelectzpe: -1460.340804 hartree
zpe.sumelectthermal: -1460.316176 hartree
zpe.sumelectthermalent: -1460.315231 hartree
zpe.sumelectthermalfe: -1460.397435 hartree
dipole: -0.9722 5.5084 4.5148
dipole: 7.1883
quadrupole: -100.4584 -139.5077 -141.9171
quadrupole: -32.1755 -17.2379 -10.5354
quadrupole: 26.8360 -12.2133 -14.6227 -32.1755 -17.2379 -10.5354
hfenergy: -1460.6517551 hartree
pointgroup: C01 [X(C14H18N4O4S1)]
dipole: 0.020508 -2.1178722 -1.8740964 debye
polarizability: 288.1894149|-26.3086907|177.1444815|-23.2159153|-1.4871234|235.7071773 unknown
InChI: InChI=1S/C14H18N4O4S/c1-9-8-12(13(21-2)22-3)17-14(16-9)18-23(19,20)11-6-4-10(15)5-7-11/h4-8,13,18H,15H2,1-3H3
charge 0 multiplicity 1
41 atoms
S  2.18828 0.979083 1.319029
O  -5.209145 0.165348 0.380304
O  -4.307538 -1.918365 0.998207
O  1.959924 2.503491 0.823142
O  2.909327 0.654963 2.742921
N  0.559324 0.124659 1.598695
N  -1.751788 -0.064946 1.330343
N  -0.321175 0.599071 -0.541293
N  5.083786 -2.131369 -2.976859
C  3.030979 0.00113 -0.016939
C  -2.828584 -0.024854 0.49201
C  -0.540425 0.23809 0.75662
C  -4.146995 -0.450762 1.113006
C  -2.71402 0.34581 -0.866975
C  -1.423436 0.665034 -1.354035
C  2.877899 0.400509 -1.356364
C  3.843962 -1.077106 0.376699
C  3.571264 -0.31551 -2.34547
C  4.530384 -1.792056 -0.618798
C  4.402817 -1.424216 -1.994067
C  -1.178496 1.100215 -2.778382
C  -6.540493 -0.102441 0.945798
C  -3.682438 -2.666497 2.097635
H  0.389084 -0.029712 2.600167
H  -4.166029 -0.178926 2.195939
H  -3.602628 0.392678 -1.496923
H  2.227243 1.24347 -1.603806
H  3.948989 -1.330045 1.436464
H  3.473011 -0.022228 -3.396931
H  5.172966 -2.634181 -0.337726
H  -0.396825 0.470354 -3.239533
H  -2.095803 1.038939 -3.385562
H  -0.809036 2.14203 -2.797017
H  5.005861 -1.871782 -3.956076
H  5.681141 -2.917267 -2.736224
H  -6.60617 0.27199 1.988521
H  -6.762021 -1.183386 0.922947
H  -7.248963 0.448571 0.309509
H  -2.58137 -2.562169 2.083408
H  -3.963522 -3.719104 1.936542
H  -4.061442 -2.32381 3.083475
