program: Gaussian 09
title: 000234715
version: EM64L-G09RevD.01
frameworkgroup: C1[X(C12H12N4O3S)]
method: RPBEPBE
basis: SDD
operation: Freq
keyword: #p
keyword: freq=noraman
keyword: PBEPBE/SDD
title: #p freq=noraman PBEPBE/SDD
converged: YES YES NO NO
title: Mulliken charges:
elementType: S O O O N N N N C C C C C C C C C C C C H H H H H H H H H H H H
charge: 0.982141 -0.549136 -0.489771 -0.279842 -0.646278 -0.060629 -0.687298 -0.634351 -0.091818 -0.224534 -0.143138 0.283833 0.517772 -0.391228 -0.408593 -0.318685 0.293258 -0.249142 -0.469059 0.153973 0.343216 0.285616 0.283410 0.231877 0.229777 0.234247 0.285573 0.228458 0.315680 0.315581 0.321309 0.337781
chargesum: 0.00000
title: Mulliken charges with hydrogens summed into heavy atoms:
elementType: S O O O N N N N C C C C C C C C C C C C
charge: 0.982141 -0.549136 -0.489771 -0.279842 -0.303062 -0.060629 -0.056037 0.024739 -0.091818 0.061082 0.140272 0.283833 0.517772 -0.159350 -0.178816 -0.084437 0.293258 0.036431 -0.240602 0.153973
polarizability: 2.81238103e+02 -1.63550759e-01 2.12612101e+02 1.18835258e+01 2.20696472e+01 1.36051056e+02
1716.lowfreq: -9.8220 -6.1869 -3.2434 -0.0020 -0.0020 0.0012 15.9593 28.1189 41.0622
frequency: 15.8425 28.0536 41.0285 54.3368 57.7085 85.2815 110.9329 136.5461 149.5640 194.2165 206.6246 230.6596 240.9781 271.0023 300.8709 319.4097 365.8026 403.0122 406.6954 411.1471 412.6203 414.9823 432.1469 445.9523 453.5482 465.6128 480.0298 514.8660 519.0874 578.7322 584.0667 600.0643 621.4257 622.5359 690.2477 710.9885 719.7058 725.8766 774.0461 800.4622 809.3201 815.2385 833.7458 844.5885 859.4681 924.0210 944.5071 951.0373 965.8629 980.4680 987.3087 993.4272 1022.9719 1047.3597 1049.8230 1124.6228 1132.6205 1144.0866 1184.8437 1196.7603 1302.5996 1318.0306 1323.4003 1329.2543 1346.6009 1360.3933 1384.0068 1401.5311 1436.1053 1480.8584 1489.6585 1529.8859 1582.6600 1586.1698 1594.1049 1613.6005 1632.5880 1649.5848 3108.1201 3135.6889 3138.1383 3146.8962 3165.2306 3169.1819 3180.0021 3505.1456 3527.0511 3561.9333 3680.4654 3700.7738
redmass: 5.9603 4.6180 4.1868 8.3058 5.2819 5.9412 6.8539 7.3447 6.4903 8.1071 8.8846 8.3262 7.1412 5.6131 6.1611 6.1944 5.3560 3.1609 5.0022 4.2818 1.7579 1.3833 1.7731 2.5295 1.7786 2.4934 1.4009 2.2992 2.5574 2.9128 1.5551 5.8418 6.2150 6.8006 3.9652 4.4554 2.9885 5.0481 5.1540 5.7018 1.3278 8.5303 1.8054 1.5794 5.2345 1.5087 1.4230 9.5066 1.3812 5.1629 3.6803 1.3656 1.4387 1.9724 2.4969 1.7471 1.2058 1.7452 1.1187 1.4228 1.2919 3.5589 2.4441 1.3952 3.5521 4.2743 3.3642 5.5898 3.7525 3.0253 2.9147 6.3054 2.4055 7.3791 5.8872 4.8547 1.8822 1.2215 1.0910 1.0899 1.0894 1.0889 1.0959 1.0978 1.0951 1.0782 1.0448 1.0453 1.1041 1.1040
irintensity: 1.1950 3.4832 1.4995 0.8197 14.0267 2.5121 0.3774 0.0367 7.7853 6.3989 0.3973 14.1937 7.7730 4.0449 21.9412 9.2906 1.5171 3.5273 21.1617 16.5955 1.5078 0.8280 86.9762 331.1995 55.4074 141.7512 48.1945 52.2417 73.1951 139.7398 62.7765 31.4217 25.8641 0.7911 181.1027 56.9676 17.7817 20.2898 18.2846 50.3945 2.3968 94.0109 82.1436 44.1444 32.2643 8.7575 2.4191 61.2187 0.9829 9.0584 2.4174 2.6161 1.4052 5.1101 61.5282 14.7978 10.3055 28.7943 58.5690 10.7070 4.7080 106.4200 51.2526 4.9626 113.1813 253.6218 281.9318 14.9673 2.9006 137.5731 71.0351 1.7621 253.1117 4.8399 224.7921 172.6897 256.4226 263.1493 26.8004 13.4506 13.5658 3.7372 7.2478 4.9128 6.4189 65.7668 42.9451 116.5839 30.3934 25.4754
temp: 298.150 k
press: 1.00000 atm
elementType: 16 8 8 8 7 7 7 7 6 6 6 6 6 6 6 6 6 6 6 6 1 1 1 1 1 1 1 1 1 1 1 1
symmnumber: 1
zpe: 608830.1 jmol-1
zpe.correction: 0.231891 hartree
zpe.thermalcorrener: 0.251124 hartree
zpe.thermalcorrenthalpy: 0.252068 hartree
zpe.thermalcorrgfe: 0.182211 hartree
zpe.sumelectzpe: -1305.630088 hartree
zpe.sumelectthermal: -1305.610855 hartree
zpe.sumelectthermalent: -1305.609911 hartree
zpe.sumelectthermalfe: -1305.679768 hartree
dipole: -3.7312 6.6126 -1.1028
dipole: 7.6723
quadrupole: -120.7796 -107.9490 -124.8154
quadrupole: -24.2843 23.1478 17.3524
quadrupole: -2.9316 9.8990 -6.9674 -24.2843 23.1478 17.3524
hfenergy: -1305.861979 hartree
pointgroup: C01 [X(C12H12N4O3S1)]
dipole: 0.9798546 2.7723713 -0.6820491 debye
polarizability: 279.3037636|16.4825307|189.6216114|8.3111306|-41.8545914|160.9758851 unknown
InChI: InChI=1S/C12H12N4O3S/c13-9-2-4-10(5-3-9)20(18,19)16-11-6-1-8(7-15-11)12(14)17/h1-7,16H,13-14H2
charge 0 multiplicity 1
32 atoms
S  1.758606 -1.694862 0.12422
O  2.837556 -2.476914 1.062326
O  1.216289 -2.353637 -1.250956
O  -5.785246 0.273041 0.890764
N  0.370119 -1.522618 1.374711
N  -1.069706 -0.38346 -0.096515
N  3.930472 3.84217 -0.931223
N  -5.083614 0.655021 -1.285139
C  2.377657 0.029625 -0.181149
C  3.444703 0.485867 0.614264
C  1.808088 0.79063 -1.217329
C  -0.918251 -1.118471 1.049382
C  3.415118 2.577343 -0.68117
C  3.962629 1.766604 0.3611
C  2.334069 2.068159 -1.466936
C  -2.016056 -1.420501 1.916361
C  -3.473193 -0.221343 0.361152
C  -3.287976 -0.95374 1.566935
C  -2.320572 0.038637 -0.419648
C  -4.856837 0.249338 0.023006
H  0.539597 -2.178514 2.146874
H  3.866415 -0.157768 1.392714
H  0.970819 0.38821 -1.793731
H  4.796599 2.144218 0.96341
H  1.91004 2.681934 -2.269739
H  -1.858403 -1.999527 2.831537
H  -4.161631 -1.14185 2.199079
H  -2.376177 0.639604 -1.336419
H  4.701106 4.210673 -0.380848
H  3.551292 4.424119 -1.672852
H  -4.40201 0.531228 -2.030449
H  -6.017803 0.988783 -1.519331
