program: Gaussian 09
title: 000234706
version: EM64L-G09RevD.01
frameworkgroup: C1[X(C12H12O3)]
method: RPBEPBE
basis: SDD
operation: Freq
keyword: #pfreq=noraman
keyword: PBEPBE/SDD
title: #p freq=noraman PBEPBE/SDD
converged: YES YES NO NO
title: Mulliken charges:
elementType: O O O C C C C C C C C C C C C H H H H H H H H H H H H
charge: -0.241232 -0.221461 -0.209290 -0.330522 0.513181 0.326424 -0.417125 -0.365178 -0.480046 0.439374 -0.413838 -0.350432 0.169947 -0.805166 -0.516057 0.262781 0.230264 0.252017 0.280949 0.230877 0.231203 0.228759 0.223804 0.236158 0.253009 0.234435 0.237165
chargesum: 0.00000
title: Mulliken charges with hydrogens summed into heavy atoms:
elementType: O O O C C C C C C C C C C C C
charge: -0.241232 -0.221461 -0.209290 -0.067740 0.513181 0.326424 -0.186861 -0.113161 -0.199098 0.439374 -0.182962 -0.119229 0.169947 -0.116445 0.208552
polarizability: 1.78515429e+02 1.70357515e+01 1.31481175e+02 3.09637948e+00 1.69927293e+01 1.01031701e+02
1716.lowfreq: -4.4392 -1.4509 -0.0007 0.0003 0.0005 3.6926 13.9434 40.2502 52.2106
frequency: 10.8146 40.1948 52.2074 63.7370 119.4433 152.9365 162.3385 200.9887 210.0076 214.2135 284.2010 325.5761 355.5982 403.0288 412.9134 467.6215 496.2436 543.6881 574.6095 629.3785 636.5207 673.0989 691.9379 724.5725 772.8373 807.3008 814.3586 820.1229 845.8336 851.8324 896.6578 951.1797 954.3833 976.3881 980.1097 989.9832 1015.3110 1047.8950 1102.5924 1115.1869 1126.1498 1151.4972 1192.0911 1203.4744 1208.5169 1222.5909 1230.2861 1270.3055 1312.3131 1319.1288 1380.6928 1398.3319 1408.1877 1429.9296 1464.6058 1465.9686 1471.0035 1475.3280 1508.8443 1589.2145 1621.4011 1625.6663 1709.4459 2977.7567 2983.8981 3012.8556 3056.8551 3082.7493 3085.6422 3117.6238 3122.3819 3141.0114 3148.5945 3156.8260 3230.5980
redmass: 3.7958 1.1053 3.2466 6.3292 3.6162 2.6878 2.5179 3.3439 3.3591 2.2659 6.0955 4.1945 2.8751 2.8741 5.5000 5.1390 3.1334 5.6355 5.2638 5.9675 5.4924 4.8217 5.9364 3.1471 3.7631 6.3170 2.0087 1.5352 2.0707 1.5663 5.4786 2.1492 2.3268 1.4267 3.0992 1.5991 2.8351 1.5632 2.8212 1.2622 1.3323 1.2982 1.1535 2.1635 2.0623 2.8132 1.6949 1.6217 3.9819 1.3137 4.4351 1.2739 2.7356 1.2054 1.0492 1.0500 1.0503 1.0985 2.6890 6.1950 7.3727 6.4796 12.2647 1.0375 1.0314 1.0840 1.0971 1.1052 1.0990 1.0873 1.0890 1.0967 1.1022 1.0954 1.0980
irintensity: 0.7434 0.8666 2.3177 0.2789 0.6129 2.3035 5.1807 5.2676 0.6611 5.0541 2.5850 0.4164 1.4680 0.7621 0.8030 3.0418 17.3923 4.9584 10.0330 0.5544 2.8519 0.3834 2.0438 0.3127 11.7002 78.3390 67.8558 71.9040 5.5712 4.6297 25.4790 39.8919 26.7031 2.6242 43.6010 10.0248 2.6927 14.5549 101.1069 0.4799 12.5604 0.5743 8.1605 65.7449 8.8970 0.3041 21.7205 7.4753 95.1089 2.5871 1.3827 10.0991 4.1033 10.9125 16.6770 18.3209 13.2664 15.5165 27.0961 0.4905 251.7973 32.5382 469.3582 35.1308 38.8506 11.6329 20.3779 29.5052 19.3184 11.4284 18.2680 23.3417 11.6508 3.6186 2.7792
temp: 298.150 k
press: 1.00000 atm
elementType: 8 8 8 6 6 6 6 6 6 6 6 6 6 6 6 1 1 1 1 1 1 1 1 1 1 1 1
symmnumber: 1
zpe: 552014.4 jmol-1
zpe.correction: 0.210251 hartree
zpe.thermalcorrener: 0.224398 hartree
zpe.thermalcorrenthalpy: 0.225343 hartree
zpe.thermalcorrgfe: 0.166670 hartree
zpe.sumelectzpe: -689.042264 hartree
zpe.sumelectthermal: -689.028116 hartree
zpe.sumelectthermalent: -689.027172 hartree
zpe.sumelectthermalfe: -689.085844 hartree
dipole: 1.9608 6.3335 -1.2814
dipole: 6.7528
quadrupole: -82.6489 -91.9053 -83.1718
quadrupole: -19.6117 1.4119 0.9220
quadrupole: 3.2598 -5.9966 2.7369 -19.6117 1.4119 0.9220
hfenergy: -689.2525148 hartree
pointgroup: C01 [X(C12H12O3)]
dipole: 0.6887309 -2.560039 0.1735743 debye
polarizability: 177.5952453|-18.4443098|127.4104871|-3.3690903|20.2756124|106.0225719 unknown
InChI: InChI=1S/C12H12O3/c1-8-3-5-9(6-4-8)12-10(14-2)7-11(13)15-12/h3-7,12H,1-2H3
charge 0 multiplicity 1
27 atoms
O  -1.495292 1.639309 -0.623053
O  -1.56283 -1.991006 -0.338357
O  -3.320722 2.432414 0.618726
C  -0.91002 0.311369 -0.934245
C  0.545728 0.223245 -0.496454
C  -1.842198 -0.659679 -0.210159
C  1.465333 -0.534164 -1.25672
C  0.991546 0.868633 0.682156
C  -2.829672 0.012464 0.457777
C  3.267494 -0.018086 0.341828
C  2.809151 -0.656407 -0.837546
C  2.334794 0.74789 1.091313
C  -2.658191 1.458914 0.223573
C  4.716217 -0.126886 0.785102
C  -2.458147 -2.918876 0.382759
H  -0.987221 0.158473 -2.027687
H  1.13473 -1.034661 -2.175012
H  0.293386 1.485139 1.257999
H  -3.639509 -0.377098 1.071242
H  3.510968 -1.247848 -1.437616
H  2.669609 1.259618 2.002142
H  4.791528 -0.424195 1.847339
H  5.269339 -0.869574 0.184823
H  5.238909 0.843147 0.681762
H  -2.078466 -3.924388 0.156539
H  -3.496324 -2.806165 0.02033
H  -2.41094 -2.723383 1.469336
