program: Gaussian 09
title: 000234701
version: EM64L-G09RevD.01
frameworkgroup: C1[X(C12H10N4)]
method: RPBEPBE
basis: SDD
operation: Freq
keyword: #pfreq=noraman
keyword: PBEPBE/SDD
title: #p freq=noraman PBEPBE/SDD
converged: YES YES NO NO
title: Mulliken charges:
elementType: N N N N C C C C C C C C C C C C H H H H H H H H H H
charge: -0.171758 -0.064300 -0.019956 -0.008806 -0.550652 0.133453 0.497097 0.038367 -0.191595 -0.441701 -0.357527 -0.312761 -0.214461 -0.222673 -0.237594 -0.354758 0.269162 0.241831 0.277983 0.233551 0.244668 0.264155 0.231412 0.232253 0.233976 0.250632
chargesum: 0.00000
title: Mulliken charges with hydrogens summed into heavy atoms:
elementType: N N N N C C C C C C C C C C C C
charge: -0.171758 -0.064300 -0.019956 -0.008806 -0.039659 0.133453 0.497097 0.038367 0.086388 -0.208150 -0.112859 -0.048605 0.016951 0.009580 -0.003618 -0.104126
polarizability: 2.08244123e+02 -2.27960581e+01 1.20770385e+02 8.87179821e+00 -2.45301472e+00 1.12430164e+02
1716.lowfreq: -0.0009 -0.0006 -0.0002 4.0365 8.5924 15.9364 23.7097 29.8567 57.3596
frequency: 22.6352 29.8356 57.3445 146.0139 171.8273 223.1957 229.3962 292.6609 329.6020 403.7714 410.1895 461.0288 482.6494 538.9852 584.0804 606.2786 618.9641 629.4253 645.3752 702.9910 722.3995 765.1004 774.2355 794.8184 811.0325 851.4021 854.2640 858.7944 904.0351 914.7052 946.5795 967.9734 979.6010 990.8165 1000.7206 1026.6382 1058.5407 1079.2742 1098.5842 1144.1057 1174.5781 1175.7232 1189.3707 1214.6997 1243.1313 1270.6252 1277.1811 1296.8877 1332.2862 1337.4841 1370.3088 1375.3488 1388.4341 1409.7535 1441.8688 1455.1078 1477.9760 1488.6700 1529.7124 1565.7216 1597.4465 1616.2188 3001.1291 3055.4331 3116.8636 3126.1164 3137.7977 3150.2522 3154.6325 3167.0094 3175.1114 3231.7600
redmass: 5.1680 4.1149 5.8531 5.7940 5.0051 4.0351 4.8143 5.4108 2.5019 2.8027 4.2397 3.2258 5.2699 7.6234 4.2708 5.5741 5.8717 5.5646 5.1987 2.3288 2.1330 5.5257 3.0491 4.7868 3.7425 1.5992 1.2601 4.7273 1.5116 1.4009 1.5022 1.9339 1.3931 6.1724 1.3330 2.2558 3.7605 2.4053 2.3225 3.2321 1.1111 1.7875 1.1123 2.6606 1.7111 7.4590 2.2133 2.0312 1.8415 1.7699 1.7453 2.5795 4.2017 2.0048 2.2813 2.5235 1.4911 1.8053 9.1156 7.6188 6.1036 6.0484 1.0592 1.1041 1.0884 1.0866 1.0909 1.0959 1.0933 1.1015 1.0930 1.0987
irintensity: 0.3299 0.5523 0.0183 1.9839 1.2966 1.6385 0.5999 1.1943 2.6596 0.4434 0.8550 4.7621 12.5855 5.7641 2.5058 2.8774 0.9266 9.9239 18.1223 23.6729 71.6765 7.3723 13.9463 10.3284 11.6864 10.5123 0.2860 20.0480 26.5318 0.5860 0.6750 12.5049 0.0317 0.7513 0.6403 7.4322 8.0431 7.7787 3.4496 2.4187 5.7442 43.6009 0.8943 5.2058 22.5544 18.3011 55.7495 30.8834 10.8393 32.5176 27.7787 11.4164 2.5630 1.5637 41.5990 49.9905 23.9675 18.3084 20.9699 84.2926 1.4807 4.0504 23.9550 7.1903 8.8775 3.1969 9.4120 33.3904 11.4393 20.3957 12.1195 0.1030
temp: 298.150 k
press: 1.00000 atm
elementType: 7 7 7 7 6 6 6 6 6 6 6 6 6 6 6 6 1 1 1 1 1 1 1 1 1 1
symmnumber: 1
zpe: 524410.0 jmol-1
zpe.correction: 0.199737 hartree
zpe.thermalcorrener: 0.211711 hartree
zpe.thermalcorrenthalpy: 0.212655 hartree
zpe.thermalcorrgfe: 0.159254 hartree
zpe.sumelectzpe: -681.170225 hartree
zpe.sumelectthermal: -681.158252 hartree
zpe.sumelectthermalent: -681.157307 hartree
zpe.sumelectthermalfe: -681.210708 hartree
dipole: -4.5977 0.2128 -1.2648
dipole: 4.7732
quadrupole: -95.2952 -97.5880 -88.7139
quadrupole: -1.8650 -1.7002 -6.0902
quadrupole: -1.4295 -3.7223 5.1518 -1.8650 -1.7002 -6.0902
hfenergy: -681.3699625 hartree
pointgroup: C01[X(C12H10N4)]
dipole: -1.8028317 -0.4024645 0.3383216 debye
dipolederiv: -0.8638318 -0.1614667 -0.012377 0.1212226 -0.3418772 -0.2010678 0.3112518 -0.1188229 -0.3897967 -0.6933466 -0.0251028 0.091764 -0.1329884 -0.3266628 -0.0111314 0.1066132 -0.0595803 -0.3151765 -0.5773237 -0.0975499 0.0568227 -0.2321721 -0.3227099 -0.0893076 -0.0303365 -0.0963386 -0.3063963 -0.4522096 -0.0035317 0.087937 -0.1387172 -0.43157 -0.1653974 -0.002919 -0.2159157 -0.4318749 0.7026494 -0.0379995 -0.0884301 -0.2401135 0.2077005 -0.1100801 -0.3543862 -0.085369 0.2717788 0.8383362 0.3933123 0.1455583 0.3232507 0.1789853 0.0159106 -0.0913394 -0.1586047 0.0383365 0.1511194 -0.0129697 0.098839 0.0066026 -0.0294862 0.0106779 0.2033915 -0.000865 -0.0423647 -0.3146849 -0.040979 0.1197564 0.2104967 0.1769883 -0.0060085 0.4702967 0.1239196 0.0118968 0.3631617 -0.0691103 -0.2081783 -0.28935 0.1626256 0.2561588 -0.4705087 0.2579383 0.3560107 -0.1569071 0.0156108 0.0120913 0.0811612 -0.0181322 -0.1119012 -0.0240428 -0.1233577 -0.0475274 -0.0473065 0.0767646 -0.0317623 0.0957687 -0.0663966 -0.0361375 -0.0665806 -0.0199653 -0.1199409 0.4443333 0.0715115 -0.165238 0.1661609 0.2031591 0.1509214 -0.0985801 0.186468 0.2279275 0.066155 0.1013936 0.0003417 0.1006435 -0.0312639 -0.0503683 -0.0237082 -0.0526172 -0.097692 -0.0624846 0.016242 0.0167901 -0.0001013 0.0237182 -0.1339408 0.0351219 -0.1333857 -0.0159505 0.0297665 -0.0175462 0.0979554 -0.0157006 -0.1006854 -0.0574674 0.0824081 -0.0586402 -0.0750606 0.3917146 0.0750757 -0.1482807 0.18532 0.2698464 0.2543367 -0.0691509 0.2858194 0.2887169 0.0206721 -0.0076908 -0.0743709 0.0538798 0.0453588 -0.0674406 0.0212548 -0.019639 0.0538017 -0.037784 -0.032599 0.0637592 0.0006385 -0.0489054 0.1340105 0.0618258 0.0616705 0.0217894 0.0520691 -0.0767996 0.0014199 -0.0747843 0.1147071 -0.0267868 0.0048687 -0.0121383 0.1260643 0.1060909 0.0217835 -0.0402452 0.0000308 -0.001888 0.1269908 -0.0215386 0.12856 0.0311228 -0.02042 -0.0942468 0.0121001 -0.126613 0.0674148 0.0328806 0.0215955 0.0253506 0.1047261 0.0377938 0.029288 0.0751024 0.0274794 0.0915168 -0.0512095 0.0795631 -0.052874 0.0294949 -0.0690749 -0.0991781 0.0122948 -0.1113507 0.0533793 0.0490161 0.0089868 0.0506684 0.1200481 0.0783421 -0.0107085 -0.013764 0.0098127 -0.0009069 0.1288134 -0.0310598 0.1281238 0.0384344 -0.0664716 0.0252882 -0.0983622 0.0270648 0.1087322 0.0544538 -0.1084491 0.0544927 0.0782317 0.0796412 -0.0387916 -0.0115237 -0.0476416 0.0163519 -0.0959256 -0.0145781 -0.0948976 0.0434002 unknown
polarizability: 203.7454579|30.6952144|125.530968|4.9515758|2.7418589|112.1682454 unknown
InChI: InChI=1S/C12H10N4/c1-2-4-10(5-3-1)7-16-9-15-11-6-13-8-14-12(11)16/h1-6,8-9H,7H2
charge 0 multiplicity 1
26 atoms
N  0.490511 -0.666394 0.384092
N  1.893274 -1.467554 -1.262801
N  1.947421 1.105008 1.31723
N  4.117743 1.235094 0.169008
C  -0.696263 -0.516035 1.253495
C  1.659723 0.091759 0.463992
C  -1.971969 -0.202398 0.479578
C  2.525922 -0.41661 -0.563721
C  0.692005 -1.576779 -0.667328
C  -3.14584 -0.961612 0.70142
C  -2.006384 0.870704 -0.446949
C  3.786294 0.208924 -0.673491
C  -4.341384 -0.652627 0.011849
C  -3.197282 1.1775 -1.138957
C  -4.369201 0.417099 -0.910794
C  3.194706 1.627812 1.109085
H  -0.443066 0.304369 1.951228
H  -0.826446 -1.436334 1.851741
H  -0.078222 -2.288315 -0.958989
H  -3.12784 -1.795662 1.414329
H  -1.101568 1.464375 -0.624127
H  4.531476 -0.091854 -1.41691
H  -5.244181 -1.246718 0.19134
H  -3.214543 2.00834 -1.852838
H  -5.293394 0.656419 -1.448153
H  3.493209 2.451289 1.763471
