program: Gaussian 09
title: 000234693
version: EM64L-G09RevD.01
frameworkgroup: C1[X(C14H20O2)]
method: RPBEPBE
basis: SDD
operation: Freq
keyword: #pfreq=noraman
keyword: PBEPBE/SDD
title: #p freq=noraman PBEPBE/SDD
converged: YES YES NO NO
title: Mulliken charges:
elementType: O O C C C C C C C C C C C C C C H H H H H H H H H H H H H H H H H H H H
charge: -0.270495 -0.244057 0.322565 -0.003969 -0.391832 -0.725511 -0.757924 -0.055484 -0.771102 0.357589 -0.398611 -0.389042 -0.391107 -0.374744 0.440669 -0.810385 0.186225 0.231729 0.187080 0.210813 0.199851 0.263308 0.224337 0.211230 0.218239 0.186077 0.215351 0.241696 0.232474 0.260664 0.258540 0.227262 0.227027 0.222850 0.235025 0.223662
chargesum: 0.00000
title: Mulliken charges with hydrogens summed into heavy atoms:
elementType: O O C C C C C C C C C C C C C C
charge: -0.270495 -0.244057 0.322565 0.182255 0.026977 -0.051538 -0.104119 0.130593 -0.081581 0.357589 -0.137946 -0.130502 -0.163845 -0.147717 0.440669 -0.128848
polarizability: 2.13105914e+02 1.08719865e+00 1.50488455e+02 9.23120927e+00 5.81822527e-01 1.05265242e+02
1716.lowfreq: -3.1920 -0.0007 -0.0005 -0.0003 0.8563 7.1475 17.2747 26.9837 46.7450
frequency: 17.0376 26.9483 46.7358 94.2064 105.4790 150.3299 165.2380 208.3973 218.9754 224.4851 228.9952 265.0487 266.2727 283.8623 322.2312 348.9835 353.3511 396.2394 406.6389 432.7950 459.0144 481.6637 505.6873 539.6367 597.4143 627.2232 636.5881 713.6858 724.1404 771.8816 811.0255 837.4984 857.1165 869.4494 887.4176 896.9852 924.5421 941.4291 942.6088 969.2159 977.3582 982.3534 988.9594 1001.8739 1013.7147 1027.1672 1040.3978 1046.6182 1088.9623 1122.4574 1137.4884 1178.0601 1186.9835 1200.2860 1218.5818 1221.9607 1222.2131 1274.5645 1294.0820 1306.1199 1331.8682 1335.8411 1351.3874 1361.2352 1375.6625 1379.1478 1388.8816 1395.1856 1399.8024 1403.5770 1447.8406 1462.1094 1465.1060 1466.9802 1471.7860 1473.6030 1483.8844 1487.1302 1490.5609 1512.1755 1586.6649 1629.2505 2842.2411 2893.5050 2918.7283 2969.8379 2973.6882 2983.7160 3000.1600 3054.5191 3058.2897 3067.7731 3072.4567 3076.5400 3083.2916 3094.5449 3100.6140 3104.7765 3119.6724 3122.8558 3163.1335 3167.7522
redmass: 1.0583 3.1986 3.7544 3.7775 3.4020 1.9223 1.1770 2.9719 1.9675 1.1080 3.4866 2.3994 2.0437 2.7422 4.1963 2.6693 2.4126 2.1716 2.8307 4.5047 3.4246 2.9251 4.0464 3.6298 4.0742 4.9608 6.8567 3.2804 3.2215 2.8952 1.8171 2.8819 1.2513 2.2576 2.6085 3.1193 2.7837 1.4244 3.9672 1.4956 1.4922 1.3904 1.4236 1.6294 3.4273 3.2737 1.6184 1.5711 2.0315 1.3107 2.5525 2.4171 1.1243 1.4711 2.1411 2.4503 2.5086 1.5393 1.4826 1.2718 1.3350 1.3435 1.3692 1.7031 4.0803 1.2160 1.2893 1.2279 1.2095 3.1903 1.0839 1.0492 1.0519 1.0523 1.0756 1.0702 1.0526 1.0551 1.0559 2.8695 6.4979 6.4742 1.0801 1.0820 1.0690 1.0365 1.0384 1.0366 1.0360 1.0952 1.0983 1.0977 1.0964 1.0981 1.0997 1.0990 1.0990 1.0996 1.0894 1.0896 1.0939 1.0950
irintensity: 0.6008 0.0129 1.3179 0.9413 1.2985 0.2523 0.5882 2.0520 0.4565 0.1733 0.7876 0.3344 0.3684 0.2971 6.2902 0.2343 0.7426 1.9894 0.0996 7.3332 0.1440 9.3125 1.7074 1.4507 8.6830 10.7955 1.4455 0.7018 2.8655 13.4618 54.0119 2.8324 0.6182 7.4775 6.8427 16.7296 71.6972 4.1726 28.6332 1.9763 11.7793 1.6159 6.2390 8.7002 87.2283 75.2440 27.5845 16.9210 115.0632 5.8129 3.8109 15.6173 14.8737 2.9521 3.7121 0.5172 3.9094 2.6875 41.8771 5.9082 32.4233 4.8342 8.1473 45.3162 1.6949 25.2277 24.5089 10.1722 27.3265 4.4736 5.0556 7.6071 9.4906 9.1608 14.0666 13.5579 11.8837 20.8396 4.7964 19.2757 0.2529 5.8124 60.0001 39.0058 98.7725 41.6183 39.5631 27.2261 19.9274 24.8065 23.1920 5.8768 46.3060 55.5347 19.1702 20.7226 24.5290 22.4129 21.5004 20.8476 12.4435 1.0180
temp: 298.150 k
press: 1.00000 atm
elementType: 8 8 6 6 6 6 6 6 6 6 6 6 6 6 6 6 1 1 1 1 1 1 1 1 1 1 1 1 1 1 1 1 1 1 1 1
symmnumber: 1
zpe: 805412.5 jmol-1
zpe.correction: 0.306765 hartree
zpe.thermalcorrener: 0.323308 hartree
zpe.thermalcorrenthalpy: 0.324253 hartree
zpe.thermalcorrgfe: 0.261766 hartree
zpe.sumelectzpe: -694.700479 hartree
zpe.sumelectthermal: -694.683936 hartree
zpe.sumelectthermalent: -694.682992 hartree
zpe.sumelectthermalfe: -694.745479 hartree
dipole: -1.7954 0.0626 -1.1723
dipole: 2.1451
quadrupole: -80.6072 -93.9499 -98.7932
quadrupole: 0.7874 3.0852 0.4780
quadrupole: 10.5096 -2.8331 -7.6765 0.7874 3.0852 0.4780
hfenergy: -695.0072447 hartree
pointgroup: C01 [X(C14H20O2)]
dipole: -0.6989789 0.1919164 0.4322853 debye
polarizability: 212.8431732|-4.6216256|139.8985524|-9.6960463|-19.0685372|116.1178857 unknown
InChI: InChI=1S/C14H20O2/c1-10-5-7-12(8-6-10)13-15-9-14(3,4)11(2)16-13/h5-8,11,13H,9H2,1-4H3
charge 0 multiplicity 1
36 atoms
O  -0.981038 -0.795731 0.544993
O  -0.889163 1.257804 -0.726199
C  -3.12006 0.169976 -0.319614
C  -2.429457 -0.622412 0.843241
C  -2.322539 1.497661 -0.477146
C  -3.086975 -0.619429 -1.649241
C  -4.572954 0.532379 0.072523
C  -0.320579 0.497398 0.389793
C  -2.963492 -2.027337 1.123326
C  1.157087 0.281099 0.141247
C  1.809397 -0.86967 0.641711
C  1.911782 1.257168 -0.55225
C  3.19825 -1.038258 0.449862
C  3.299172 1.080808 -0.739463
C  3.967278 -0.068884 -0.243294
C  5.456003 -0.266956 -0.474104
H  -2.513471 0.003444 1.765685
H  -2.676865 2.072935 -1.348885
H  -2.438447 2.118277 0.441967
H  -3.681501 -1.548322 -1.582046
H  -3.511798 -0.008856 -2.46816
H  -2.050348 -0.883205 -1.917714
H  -5.212317 -0.366858 0.120041
H  -4.618595 1.036682 1.057548
H  -5.017771 1.21442 -0.676696
H  -0.507785 1.087844 1.324733
H  -4.040517 -2.004946 1.364505
H  -2.805912 -2.687165 0.253952
H  -2.425912 -2.46471 1.982265
H  1.221555 -1.629167 1.165589
H  1.402191 2.138879 -0.952475
H  3.69245 -1.935845 0.841817
H  3.872412 1.844337 -1.280078
H  5.896034 -0.944808 0.278267
H  5.647961 -0.711025 -1.470467
H  6.003822 0.691573 -0.433331
