program: Gaussian 09
title: 000234691
version: EM64L-G09RevD.01
frameworkgroup: C1[X(C16H23ClO2)]
method: RPBEPBE
basis: SDD
operation: Freq
keyword: #p
keyword: freq=noraman
keyword: PBEPBE/SDD
title: #p freq=noraman PBEPBE/SDD
converged: YES YES NO NO
title: Mulliken charges:
elementType: Cl O O C C C C C C C C C C C C C C C C H H H H H H H H H H H H H H H H H H H H H H H
charge: -0.066533 -0.244045 -0.253552 0.378994 -0.484204 -0.430952 -0.426443 -0.395283 -0.382177 -0.050159 -0.737396 -0.346766 0.369327 -0.698326 -0.374368 -0.390035 -0.211038 -0.206724 -0.099995 0.192625 0.206398 0.190304 0.240039 0.239420 0.193538 0.250576 0.195491 0.202186 0.208194 0.192438 0.223079 0.216370 0.222456 0.194045 0.195309 0.211518 0.210443 0.218627 0.264985 0.272716 0.254505 0.254413
chargesum: 0.00000
title: Mulliken charges with hydrogens summed into heavy atoms:
elementType: Cl O O C C C C C C C C C C C C C C C C
charge: -0.066533 -0.244045 -0.253552 0.378994 -0.085181 -0.000609 0.006515 0.050785 0.028203 0.142279 -0.075490 0.042588 0.369327 -0.057739 -0.109382 -0.117319 0.043467 0.047689 -0.099995
polarizability: 2.69817563e+02 3.91021949e+00 1.59393302e+02 1.04017980e+01 -1.34011360e+01 1.34133559e+02
1716.lowfreq: -10.5355 -0.0008 0.0014 0.0020 2.9129 9.5566 21.8420 30.1013 42.8423
frequency: 21.6827 29.7308 42.5893 51.5740 56.5772 77.4189 104.3163 117.3833 131.0957 175.6073 182.6054 195.4340 219.3541 221.9366 256.2740 278.2962 280.1689 302.9942 319.3707 334.5141 375.5791 392.3906 408.6860 438.1231 458.1760 463.6298 485.5790 507.2187 556.3880 623.5220 641.9724 684.0278 714.1677 727.5948 728.3994 764.6335 787.3242 804.9378 835.8409 870.4327 889.3641 894.7307 901.2977 913.0301 925.1158 938.9950 950.1291 967.4827 977.8717 984.5253 1000.1510 1013.2669 1026.4974 1041.9617 1059.9026 1070.4969 1074.1960 1079.7688 1101.0441 1107.5258 1167.1602 1177.3647 1179.2108 1183.1382 1210.7975 1214.1766 1225.5180 1260.5895 1276.9475 1288.7653 1289.9055 1291.7662 1311.1126 1316.4097 1334.8989 1340.6649 1347.0934 1354.2124 1362.2577 1364.8334 1377.7520 1389.2305 1390.3247 1391.6646 1448.5586 1457.9446 1465.9416 1469.1577 1473.7943 1476.3000 1478.5957 1478.9497 1484.1580 1486.9384 1492.6640 1589.6532 1606.0368 2843.9386 2920.2224 2929.6264 2949.9036 2962.3939 2971.9166 2973.5038 2977.8073 2983.4984 2996.2025 3007.0933 3038.1352 3044.0698 3069.2681 3071.7921 3072.8824 3073.7144 3083.1129 3085.1163 3158.5661 3160.4888 3176.7748 3181.4216
redmass: 3.7968 5.1619 3.4400 1.6702 3.0033 3.8584 3.5920 3.3824 2.2962 3.6414 4.2750 2.7222 1.3826 1.8965 3.0127 2.4599 3.7215 2.6303 4.7291 2.7671 2.2811 4.0548 2.9307 2.6889 4.2041 3.1570 3.7727 4.4108 5.3227 7.1050 4.3637 3.9120 4.5584 1.0975 2.8136 1.2619 1.2717 1.7001 1.2482 2.3293 2.0678 1.8994 3.5117 3.7410 2.0644 1.5564 7.0316 1.4663 1.3636 2.2826 3.7559 1.8169 2.2870 3.7998 2.9911 2.6070 2.2553 1.9633 2.1104 1.3306 2.2103 1.4420 1.3916 2.0197 1.8762 1.2026 1.4218 1.2663 1.3385 1.2323 1.2410 1.1195 1.3375 1.1702 1.2603 1.4698 1.6305 1.6116 1.4849 1.4018 5.1680 3.2446 1.2189 1.2237 1.0788 1.0883 1.0707 1.0656 1.0636 1.0427 1.2422 1.9678 1.0674 1.0537 1.0801 8.0058 6.3256 1.0804 1.0688 1.0686 1.0612 1.0586 1.0579 1.0392 1.0369 1.0659 1.0929 1.1006 1.1036 1.0961 1.1006 1.0983 1.0993 1.0996 1.0936 1.0944 1.0884 1.0888 1.0966 1.0973
irintensity: 0.0038 0.0169 0.0453 0.0186 0.0372 0.1708 0.2440 0.2737 0.1519 1.6136 0.8329 3.2113 0.2422 0.7853 2.4809 0.1504 0.9813 0.7399 2.5252 0.8638 5.4933 4.5833 0.0144 1.0003 16.2361 0.4110 11.0381 3.3358 11.6683 1.0887 16.7100 5.7090 11.1732 10.8771 3.7853 8.1545 8.7272 79.5097 0.6154 6.0488 6.0268 8.9897 56.2972 11.8282 3.0306 6.8241 26.9471 0.8332 0.0026 18.9112 117.2505 14.8011 66.0905 73.2893 9.1237 40.9557 37.1966 15.6455 20.1443 4.1042 1.9778 24.0523 0.9286 12.3833 6.1613 1.5282 1.4360 3.0843 5.4213 4.2789 4.4766 0.1826 13.9073 0.8047 0.7767 0.9420 56.4409 51.1253 5.1442 0.8685 1.2570 10.0686 12.5438 15.8755 5.7991 9.9252 0.4520 2.6525 3.8817 13.9903 39.1365 41.3486 12.6600 7.5032 9.1699 2.9567 18.6284 64.6538 17.5810 91.4583 43.6483 10.5158 42.0000 47.7352 33.3412 26.9127 21.3070 1.3052 56.8415 0.3136 77.9175 36.8229 77.8423 36.1829 47.3869 18.2193 1.3549 1.3513 5.5990 0.9819
temp: 298.150 k
press: 1.00000 atm
elementType: 17 8 8 6 6 6 6 6 6 6 6 6 6 6 6 6 6 6 6 1 1 1 1 1 1 1 1 1 1 1 1 1 1 1 1 1 1 1 1 1 1 1
symmnumber: 1
zpe: 931716.5 jmol-1
zpe.correction: 0.354872 hartree
zpe.thermalcorrener: 0.374841 hartree
zpe.thermalcorrenthalpy: 0.375785 hartree
zpe.thermalcorrgfe: 0.304510 hartree
zpe.sumelectzpe: -1232.521984 hartree
zpe.sumelectthermal: -1232.502015 hartree
zpe.sumelectthermalent: -1232.501071 hartree
zpe.sumelectthermalfe: -1232.572346 hartree
dipole: -4.8264 -0.2857 -1.5745
dipole: 5.0848
quadrupole: -132.3967 -119.2991 -121.4798
quadrupole: 0.6997 -0.5532 -2.2014
quadrupole: -8.0048 5.0927 2.9121 0.6997 -0.5532 -2.2014
hfenergy: -1232.8768561 hartree
pointgroup: C01 [X(C16H23Cl1O2)]
dipole: 1.8913153 0.3202097 -0.5678052 debye
polarizability: 269.5508398|7.8232352|148.1676569|-9.9821823|18.2454718|145.625927 unknown
InChI: InChI=1S/C16H23ClO2/c1-3-5-10-16(4-2)11-18-15(19-12-16)13-6-8-14(17)9-7-13/h6-9,15H,3-5,10-12H2,1-2H3
charge 0 multiplicity 1
42 atoms
Cl -6.837276 0.040146 0.625686
O  -0.326675 -0.901669 -1.003619
O  -0.10911 0.918575 0.573074
C  1.965319 -0.287483 -0.171164
C  3.406409 -0.040287 -0.708002
C  1.104505 -0.803414 -1.360246
C  1.331216 1.064537 0.265558
C  1.914737 -1.283603 1.026455
C  4.445451 0.454887 0.325265
C  -0.824228 0.412668 -0.594543
C  2.541493 -2.671677 0.774437
C  5.836084 0.688458 -0.309836
C  -2.29759 0.298805 -0.264911
C  6.889443 1.170802 0.710313
C  -3.117601 -0.589196 -1.001419
C  -2.8698 1.103123 0.74873
C  -4.50203 -0.674219 -0.735028
C  -4.252885 1.02799 1.027313
C  -5.046474 0.140856 0.275813
H  3.355031 0.698455 -1.537381
H  3.78222 -0.979667 -1.164187
H  1.216853 -0.116551 -2.230876
H  1.394765 -1.819728 -1.669978
H  1.775721 1.447664 1.197685
H  1.45689 1.823676 -0.540736
H  0.855311 -1.408037 1.315886
H  2.418228 -0.812351 1.89428
H  4.103435 1.400705 0.792683
H  4.545809 -0.282439 1.146464
H  -0.635491 1.121598 -1.442636
H  2.032945 -3.212202 -0.044632
H  3.616593 -2.605707 0.524493
H  2.450319 -3.298836 1.679885
H  5.743582 1.431951 -1.127911
H  6.181834 -0.253102 -0.783707
H  7.026192 0.429768 1.520397
H  6.581421 2.124964 1.178052
H  7.87242 1.332016 0.231197
H  -2.666408 -1.226164 -1.767599
H  -2.226921 1.772411 1.326705
H  -5.140519 -1.360785 -1.298062
H  -4.700614 1.643264 1.812905
