program: Gaussian 09
title: 000234689
version: EM64L-G09RevD.01
frameworkgroup: C1[X(C12H22O2)]
method: RPBEPBE
basis: SDD
operation: Freq
keyword: #pfreq=noraman
keyword: PBEPBE/SDD
title: #p freq=noraman PBEPBE/SDD
converged: YES YES NO NO
title: Mulliken charges:
elementType: O O C C C C C C C C C C C C H H H H H H H H H H H H H H H H H H H H H H
charge: -0.294234 -0.262848 0.360339 0.326013 -0.001672 -0.495273 -0.462771 -0.406100 -0.387859 -0.377967 -0.392414 -0.734269 -0.753766 -0.773341 0.182785 0.226038 0.210062 0.221977 0.199583 0.185363 0.224598 0.194718 0.220331 0.210557 0.191791 0.187551 0.201479 0.257208 0.200089 0.211411 0.216526 0.209128 0.222032 0.239920 0.213058 0.229957
chargesum: 0.00000
title: Mulliken charges with hydrogens summed into heavy atoms:
elementType: O O C C C C C C C C C C C C
charge: -0.294234 -0.262848 0.360339 0.326013 0.181113 -0.059173 -0.041212 0.003860 0.027191 0.024382 -0.003384 -0.065561 -0.106081 -0.090406
polarizability: 1.52852763e+02 5.30621920e-01 1.20986835e+02 -2.14390876e+00 2.53044738e-01 1.18176951e+02
1716.lowfreq: -14.9699 -2.9427 -0.0006 -0.0006 -0.0001 13.5438 72.0655 85.1688 123.5283
frequency: 70.6814 85.0405 123.2695 164.1396 173.1997 199.8161 217.6743 230.4289 248.5633 253.4032 273.8185 283.8443 318.8865 335.8138 365.7347 404.3768 421.2165 446.9201 451.9922 481.4494 489.9140 526.6236 547.1686 638.2947 696.4909 728.9998 776.0992 797.3489 840.8467 854.4032 878.3240 888.8549 911.8580 914.1203 929.2121 934.0568 939.4374 970.0166 995.6190 1003.9037 1031.8542 1039.7745 1047.2082 1072.5898 1083.5512 1095.9160 1129.4339 1146.9460 1151.7624 1176.9101 1206.6767 1222.8290 1236.5841 1252.7940 1266.4289 1276.4577 1283.7390 1314.6547 1322.6322 1333.3971 1336.4380 1339.8259 1343.9772 1349.1942 1361.9403 1375.9889 1381.1291 1396.8406 1451.0316 1456.1409 1458.9919 1461.8403 1462.6995 1464.7962 1467.8666 1472.1053 1477.2730 1482.4533 1485.0045 1488.3837 2917.4827 2940.6421 2963.5786 2967.6383 2981.8526 2983.5956 2990.2914 2992.6670 2997.0806 3003.6643 3029.5756 3038.6242 3049.7567 3054.1286 3055.2242 3060.0244 3069.5027 3073.2364 3074.7192 3092.7287 3098.6738 3101.0589
redmass: 3.3430 3.1227 2.6797 1.2977 1.4040 2.0406 1.1138 2.3294 1.7560 2.0994 2.4319 2.7489 2.9470 1.9210 2.2993 1.9564 3.8391 2.2489 3.5010 3.3510 3.3061 2.7415 2.4695 3.9751 3.1739 3.4860 1.4959 2.1966 2.6181 2.0159 1.7144 3.3774 2.1325 2.3953 1.4704 2.6228 1.3978 1.4727 2.3312 2.0652 2.0963 2.0164 1.7421 1.2544 2.0867 1.4938 2.4896 1.8316 2.2121 2.4372 1.5402 2.5588 1.6647 1.3649 1.3252 1.5638 1.6666 1.4344 1.4087 1.4237 1.4181 1.4623 1.5486 1.3508 1.5388 1.2203 1.2774 1.2047 1.0872 1.0654 1.0842 1.0535 1.0875 1.0514 1.0647 1.0836 1.0930 1.0516 1.0536 1.0603 1.0822 1.0670 1.0625 1.0363 1.0605 1.0365 1.0612 1.0618 1.0357 1.0633 1.0960 1.1004 1.1017 1.1009 1.0984 1.0974 1.0992 1.0983 1.1015 1.0990 1.0990 1.0997
irintensity: 0.5137 0.4195 0.2550 0.3315 1.2310 0.6656 0.0841 2.0823 0.9709 1.7495 1.7828 2.4354 3.5165 1.3853 0.8858 1.2192 4.5034 1.2962 4.3795 7.5967 0.3579 2.8886 3.7465 3.3185 1.0652 1.3419 1.6342 12.0074 9.7499 10.0770 10.0831 37.2317 35.5380 15.5803 6.2201 4.2614 4.1068 7.5605 19.5361 24.0370 44.6819 41.3975 20.9289 4.9005 124.5769 6.4794 6.6760 9.9757 11.7493 9.4275 2.7223 3.2539 9.7974 8.4573 24.0641 10.3157 0.9628 3.7039 6.5982 2.4257 0.6600 2.2550 2.9355 1.1978 19.1174 23.6176 24.9089 27.5072 7.5289 3.3357 9.3583 6.5605 4.7655 2.1295 17.8243 21.7470 7.5277 6.1091 12.4799 16.7308 33.8289 65.2231 41.0904 39.1036 29.4845 26.9602 28.4964 43.6223 21.6737 20.0218 65.5864 49.0655 5.1114 67.6558 14.6492 48.1225 17.6755 60.2636 53.5892 21.3140 30.1479 19.7023
temp: 298.150 k
press: 1.00000 atm
elementType: 8 8 6 6 6 6 6 6 6 6 6 6 6 6 1 1 1 1 1 1 1 1 1 1 1 1 1 1 1 1 1 1 1 1 1 1
symmnumber: 1
zpe: 840697.6 jmol-1
zpe.correction: 0.320205 hartree
zpe.thermalcorrener: 0.334737 hartree
zpe.thermalcorrenthalpy: 0.335681 hartree
zpe.thermalcorrgfe: 0.280807 hartree
zpe.sumelectzpe: -619.778461 hartree
zpe.sumelectthermal: -619.763928 hartree
zpe.sumelectthermalent: -619.762984 hartree
zpe.sumelectthermalfe: -619.817859 hartree
dipole: -0.9074 0.8078 1.6498
dipole: 2.0489
quadrupole: -81.5290 -89.9351 -86.9794
quadrupole: -0.5152 -0.8266 -0.3357
quadrupole: 4.6188 -3.7872 -0.8316 -0.5152 -0.8266 -0.3357
hfenergy: -620.0986656 hartree
pointgroup: C01 [X(C12H22O2)]
dipole: 0.3565116 -0.3172742 0.6496201 debye
polarizability: 152.8567745|0.4596018|120.9833796|2.1287186|-0.2643201|118.1763949 unknown
InChI: InChI=1S/C12H22O2/c1-10-11(2,3)9-13-12(14-10)7-5-4-6-8-12/h10H,4-9H2,1-3H3
charge 0 multiplicity 1
36 atoms
O  -0.048475 -0.687528 -0.540986
O  0.197101 1.67997 -0.094249
C  -0.733736 0.534447 -0.074032
C  2.211575 0.181805 0.083804
C  1.209001 -1.016346 0.178799
C  -1.795889 0.851877 -1.134551
C  -1.368142 0.339056 1.327117
C  1.45095 1.423632 0.632891
C  -2.920574 -0.209143 -1.161696
C  -2.487303 -0.730773 1.294018
C  -3.561529 -0.386889 0.235312
C  2.659634 0.443635 -1.373072
C  3.435775 -0.069686 0.997715
C  1.676862 -2.340034 -0.431126
H  0.980091 -1.173722 1.25842
H  -1.28854 0.922086 -2.11265
H  -2.212136 1.849997 -0.899469
H  -1.788136 1.317202 1.632573
H  -0.606253 0.066419 2.080536
H  1.254064 1.295364 1.720255
H  2.046657 2.342162 0.491726
H  -3.687608 0.084888 -1.903393
H  -2.493292 -1.174231 -1.494602
H  -2.038668 -1.713655 1.049577
H  -2.946008 -0.818334 2.297943
H  -4.077239 0.551726 0.527611
H  -4.331588 -1.181756 0.203733
H  1.783589 0.604074 -2.023552
H  3.295937 1.34725 -1.421888
H  3.246407 -0.402302 -1.773856
H  4.068329 0.836624 1.055614
H  3.130438 -0.333953 2.029061
H  4.067392 -0.888231 0.608611
H  1.831249 -2.235774 -1.518145
H  2.617961 -2.684156 0.032647
H  0.90781 -3.115601 -0.272096
