program: Gaussian 09
title: 000234679
version: EM64L-G09RevD.01
frameworkgroup: C1[X(C13H19NO3)]
method: RPBEPBE
basis: SDD
operation: Freq
keyword: #p
keyword: freq=noraman
keyword: PBEPBE/SDD
title: #p freq=noraman PBEPBE/SDD
converged: YES YES NO NO
title: Mulliken charges:
elementType: O O O N C C C C C C C C C C C C C H H H H H H H H H H H H H H H H H H H
charge: -0.293335 -0.284281 -0.284161 -0.377859 -0.546950 0.523142 -0.369717 -0.552712 -0.441688 0.210361 0.214361 -0.331287 0.259103 -0.491851 -0.667073 -0.520036 -0.536084 0.210503 0.222709 0.260683 0.220603 0.273535 0.233567 0.320364 0.238246 0.206421 0.232605 0.214795 0.211520 0.252629 0.211704 0.258397 0.229498 0.221623 0.226209 0.244460
chargesum: 0.00000
title: Mulliken charges with hydrogens summed into heavy atoms:
elementType: O O O N C C C C C C C C C C C C C
charge: -0.293335 -0.284281 -0.284161 -0.057496 -0.113737 0.523142 0.111568 -0.279177 -0.208122 0.210361 0.214361 -0.093041 0.259103 -0.052826 0.011871 0.179563 0.156208
polarizability: 2.05549797e+02 1.04186222e+01 1.66335327e+02 2.19688445e+01 -6.85340231e+00 1.15803742e+02
1716.lowfreq: -5.3849 0.0005 0.0005 0.0006 4.7756 8.6775 17.3934 27.2769 33.0713
frequency: 16.9090 27.2743 32.9559 49.1646 63.0327 73.0585 92.5145 110.9545 121.5153 152.4444 196.7195 198.9016 205.6078 227.6142 250.5615 270.2881 297.9191 310.6508 345.0084 353.3455 417.0550 446.8058 454.4813 482.5710 511.5551 558.5302 590.3381 598.5265 642.3883 676.3436 698.5753 712.2526 732.6848 790.6775 801.9245 817.0431 865.6518 883.9807 901.1224 927.7518 964.5736 985.6675 995.1517 1011.6726 1040.6538 1055.9053 1077.8424 1108.2922 1111.3344 1111.4518 1112.5787 1143.7484 1156.2945 1173.2856 1181.8088 1205.5779 1207.0967 1241.5348 1253.9199 1267.0842 1274.4390 1314.8347 1335.1054 1357.1057 1377.4036 1388.3255 1401.6357 1431.9165 1441.4824 1450.8395 1454.9405 1463.6151 1464.5499 1467.5947 1471.6998 1472.8064 1480.7821 1485.3477 1489.0087 1497.7398 1578.2774 1613.7193 1619.0504 2960.6601 2975.8089 2981.4744 2982.7981 2991.6634 2993.8011 3036.5819 3049.6120 3056.8848 3072.6735 3084.4670 3086.4148 3103.2420 3123.7631 3126.8919 3127.1358 3145.3264 3161.1952 3537.2205
redmass: 4.3099 4.5055 4.4490 2.7859 1.9504 3.1524 3.3934 4.2081 1.9147 2.1350 2.5144 2.8139 1.3312 1.2693 2.6282 3.7029 2.6293 3.9045 3.2204 3.9748 3.4541 3.6004 3.4086 3.8458 3.4772 3.0220 3.8156 1.3164 3.6508 3.1516 4.0610 5.1549 3.5988 1.4843 1.3980 2.0737 3.7380 2.8199 1.6042 1.3513 3.7362 7.1518 2.1653 2.5889 1.9199 1.9750 1.8687 2.7966 1.2613 1.2469 2.4985 1.4952 1.3974 1.5051 1.2641 1.5993 1.8064 1.3494 2.6121 1.2974 1.7327 1.3851 1.5228 1.4496 5.8265 1.1972 2.2782 1.2166 1.3331 1.0942 1.0749 1.1085 1.0510 1.1340 1.0595 1.1109 1.0630 1.6166 1.1283 2.4675 7.2466 6.7136 6.0705 1.0327 1.0346 1.0648 1.0592 1.0368 1.0608 1.1010 1.1041 1.1002 1.0986 1.0973 1.1007 1.1003 1.0986 1.0956 1.0987 1.0914 1.0940 1.0774
irintensity: 0.0272 0.5667 9.1855 0.1173 4.5893 10.1796 0.7574 2.0843 2.9252 3.0410 0.5322 1.5252 1.1197 1.0316 4.0245 14.2080 6.7950 8.7084 1.5946 0.3826 3.4636 3.5394 6.8070 2.7079 1.6711 18.6820 0.9669 116.6121 15.8775 4.2047 2.2278 14.3374 4.1903 2.8887 43.2246 7.3201 7.7760 5.1760 17.9293 0.7578 38.4397 30.3984 14.0922 24.2223 38.6912 6.1662 5.1744 16.4104 0.7115 4.5158 87.6731 3.5125 9.7161 5.2252 33.9685 41.3057 39.9303 89.4443 159.4879 17.8622 25.7559 18.9045 10.7756 25.1832 17.6360 20.1725 15.4831 0.1418 22.9609 12.5258 12.7786 36.3800 15.3548 25.2389 56.2274 80.6517 23.8932 219.9959 55.3864 95.3303 23.8928 10.1585 185.4406 68.0268 87.1355 32.5517 31.8158 35.1161 32.6167 17.4567 45.3108 23.8728 7.9887 36.7184 41.7112 23.0235 28.7421 14.8569 6.8266 7.2243 12.5218 29.2263
temp: 298.150 k
press: 1.00000 atm
elementType: 8 8 8 7 6 6 6 6 6 6 6 6 6 6 6 6 6 1 1 1 1 1 1 1 1 1 1 1 1 1 1 1 1 1 1 1
symmnumber: 1
zpe: 785001.5 jmol-1
zpe.correction: 0.298991 hartree
zpe.thermalcorrener: 0.317866 hartree
zpe.thermalcorrenthalpy: 0.318810 hartree
zpe.thermalcorrgfe: 0.249019 hartree
zpe.sumelectzpe: -785.881415 hartree
zpe.sumelectthermal: -785.862541 hartree
zpe.sumelectthermalent: -785.861596 hartree
zpe.sumelectthermalfe: -785.931387 hartree
dipole: 6.1951 -0.3854 1.4789
dipole: 6.3808
quadrupole: -108.2412 -95.7290 -98.6081
quadrupole: -8.4064 1.1667 -4.0883
quadrupole: -7.3818 5.1305 2.2513 -8.4064 1.1667 -4.0883
hfenergy: -786.1804062 hartree
pointgroup: C01 [X(C13H19N1O3)]
dipole: -2.4209212 0.0619259 -0.6614341 debye
polarizability: 201.5461706|-12.917614|169.1584648|25.9534231|1.2875182|116.9842309 unknown
InChI: InChI=1S/C13H19NO3/c1-4-13(15)14-8-7-10-5-6-11(16-2)12(9-10)17-3/h5-6,9,14H,4,7-8H2,1-3H3
charge 0 multiplicity 1
36 atoms
O  -1.680158 2.315784 0.424547
O  -3.668181 0.928205 -1.087259
O  4.703565 -0.924762 0.434448
N  2.508806 -0.614432 -0.284069
C  0.876241 -1.850325 1.180729
C  -0.359029 -1.153669 0.628033
C  2.0335 -1.936794 0.143316
C  -0.548579 0.240829 0.802748
C  -1.332892 -1.86726 -0.111231
C  -1.654845 0.921514 0.249388
C  -2.614596 0.189259 -0.516907
C  -2.447642 -1.207175 -0.674714
C  3.813668 -0.184276 -0.088561
C  4.102001 1.257255 -0.529811
C  5.44927 1.366271 -1.277272
C  -2.933142 2.937319 0.902608
C  -4.623246 0.202741 -1.92836
H  0.625216 -2.884242 1.486618
H  1.251729 -1.323551 2.077128
H  2.90589 -2.452253 0.581452
H  1.694016 -2.516807 -0.73785
H  0.159667 0.834924 1.390956
H  -1.225311 -2.949706 -0.249171
H  1.829488 0.028604 -0.696608
H  -3.179009 -1.787182 -1.245774
H  3.275046 1.657014 -1.147767
H  4.146683 1.876765 0.388017
H  5.41399 0.834225 -2.244886
H  5.706149 2.422821 -1.47165
H  6.248494 0.909981 -0.669374
H  -3.230746 2.502417 1.876475
H  -3.744631 2.809001 0.168687
H  -2.686304 4.002404 1.029911
H  -5.173578 -0.563418 -1.34826
H  -4.11606 -0.274878 -2.788794
H  -5.325169 0.968598 -2.28984
