program: Gaussian 09
title: 000022251
version: EM64L-G09RevD.01
frameworkgroup: C1[X(C15H14S)]
method: RPBEPBE
basis: SDD
operation: Freq
keyword: #pfreq=noraman
keyword: PBEPBE/SDD
title: #p freq=noraman PBEPBE/SDD
converged: YES YES NO NO
title: Mulliken charges:
elementType: S C C C C C C C C C C C C C C C H H H H H H H H H H H H H H
charge: 0.150299 -0.633262 -0.381138 -0.543440 0.609223 0.569930 -0.379954 -0.410598 -0.271874 -0.455623 -0.354662 -0.246189 -0.239092 -0.218825 -0.237192 -0.240898 0.278766 0.224449 0.236200 0.221105 0.227693 0.229655 0.241635 0.233406 0.250888 0.227696 0.228914 0.227066 0.226173 0.229651
chargesum: 0.00000
title: Mulliken charges with hydrogens summed into heavy atoms:
elementType: S C C C C C C C C C C C C C C C
charge: 0.150299 -0.354496 0.079510 -0.094642 0.609223 0.569930 -0.379954 -0.180943 -0.030239 -0.222217 -0.103774 -0.018493 -0.010178 0.008240 -0.011019 -0.011247
polarizability: 2.71681526e+02 6.98707234e-01 1.43480826e+02 -8.98241458e+00 -7.14293051e+00 1.14505219e+02
1716.lowfreq: -0.0002 0.0009 0.0013 3.1772 5.1624 8.8233 16.9661 37.1295 74.8630
frequency: 16.7864 36.9877 74.8566 118.6173 148.3687 204.1207 235.0929 240.6918 278.8676 324.3413 387.1298 403.8423 420.1861 434.2291 479.2544 505.9515 519.3848 562.0834 606.0907 617.0536 656.7925 661.3025 703.1034 717.7086 749.5837 764.1537 785.7674 806.0405 850.7402 861.6678 895.1362 919.5557 942.4901 954.7934 974.6580 978.0001 989.9149 995.1991 1025.7617 1029.7907 1038.5793 1047.7969 1073.7496 1084.9445 1122.5614 1152.2732 1172.3299 1172.6213 1186.6894 1199.6788 1207.0742 1212.7675 1248.0013 1276.1980 1286.4924 1327.4989 1345.2019 1361.0328 1376.3672 1386.5309 1424.8339 1441.8467 1453.5921 1456.4135 1472.6007 1481.6439 1578.9235 1593.0283 1600.7858 1611.8394 2955.8642 2990.2015 3023.6286 3031.6625 3056.7163 3113.3748 3117.3629 3125.0999 3125.8568 3137.0818 3141.7817 3147.6992 3162.3404 3163.9913
redmass: 5.3686 4.4115 4.7894 4.1346 3.5428 5.3245 4.6438 4.1188 2.3782 4.1078 5.1873 2.8024 5.5311 3.0541 4.0348 4.1487 3.3793 3.6819 4.5781 5.2155 5.6904 4.9229 1.6792 3.8155 1.2732 2.1812 2.9765 2.9471 1.2487 1.3847 2.3386 1.4832 1.3986 2.0244 1.3950 1.3225 5.4115 1.3609 2.2728 3.4588 2.8012 2.7425 2.0252 1.7051 1.6817 1.2714 1.0585 1.0642 1.1104 1.2782 1.9789 1.7942 1.5800 1.3236 1.3579 1.3211 1.5749 1.5022 5.6023 6.0702 2.1404 2.0999 1.2474 1.1207 1.8703 2.3122 6.5262 6.0360 6.3114 6.1321 1.0663 1.0613 1.0867 1.0933 1.1010 1.0876 1.0868 1.0862 1.0874 1.0914 1.0934 1.0962 1.1007 1.1015
irintensity: 0.1499 0.1975 0.4548 1.4404 0.2550 1.5295 0.3673 2.1798 0.3240 1.2060 2.0291 0.3167 0.4732 7.1463 1.5091 0.3989 9.7149 2.5293 9.8847 2.3533 5.5706 18.2906 52.9212 0.3536 83.2878 41.7351 10.7441 1.3623 0.0974 0.3302 7.5961 6.3507 2.8242 14.1268 0.0936 0.0148 0.4903 0.1432 14.7430 27.0226 9.0783 27.5764 1.9420 11.0431 4.9152 5.8445 0.0631 0.1143 0.9952 2.5248 0.6094 0.8026 14.3465 8.5570 10.0934 0.8265 3.3692 1.8847 3.4244 0.5750 17.3387 14.2090 11.0314 12.5182 45.8382 16.7722 25.9737 0.9910 11.5066 3.9222 26.9097 27.0392 6.2989 27.9675 28.1881 11.4939 7.4287 0.7844 2.6539 17.4474 22.3286 37.7047 38.8783 22.5965
temp: 298.150 k
press: 1.00000 atm
elementType: 16 6 6 6 6 6 6 6 6 6 6 6 6 6 6 6 1 1 1 1 1 1 1 1 1 1 1 1 1 1
symmnumber: 1
zpe: 637386.2 jmol-1
zpe.correction: 0.242768 hartree
zpe.thermalcorrener: 0.256013 hartree
zpe.thermalcorrenthalpy: 0.256957 hartree
zpe.thermalcorrgfe: 0.201221 hartree
zpe.sumelectzpe: -976.940021 hartree
zpe.sumelectthermal: -976.926775 hartree
zpe.sumelectthermalent: -976.925831 hartree
zpe.sumelectthermalfe: -976.981568 hartree
dipole: 0.5826 1.8978 0.3746
dipole: 2.0203
quadrupole: -89.7033 -97.9805 -101.1025
quadrupole: -0.2957 -1.6175 -3.1153
quadrupole: 6.5588 -1.7184 -4.8404 -0.2957 -1.6175 -3.1153
hfenergy: -977.1827886 hartree
pointgroup: C01 [X(C15H14S1)]
dipole: -0.2306725 -0.7158526 -0.2571506 debye
polarizability: 271.2248748|-5.5441702|129.8227178|11.015424|15.9578616|128.6199785 unknown
InChI: InChI=1S/C15H14S/c1-2-6-12(7-3-1)15-11-10-13-8-4-5-9-14(13)16-15/h1-9,15H,10-11H2
charge 0 multiplicity 1
30 atoms
S  0.323562 1.292131 0.142573
C  -0.687114 -0.116082 -0.687661
C  -0.077895 -1.48768 -0.328181
C  1.353283 -1.659756 -0.877211
C  2.376377 -0.692446 -0.292833
C  -2.139775 0.034397 -0.269195
C  2.031249 0.608013 0.163331
C  3.736494 -1.087445 -0.209396
C  3.025349 1.474436 0.68647
C  -3.143879 0.214024 -1.253536
C  -2.524458 -0.039848 1.095475
C  4.733168 -0.23067 0.302598
C  4.370914 1.059874 0.754743
C  -4.506877 0.302937 -0.88796
C  -3.883875 0.050366 1.462597
C  -4.880888 0.219324 0.472037
H  -0.593821 0.046632 -1.776294
H  -0.732553 -2.268589 -0.762827
H  -0.091045 -1.624198 0.769423
H  1.322286 -1.540083 -1.981307
H  1.693017 -2.695697 -0.690338
H  4.009395 -2.092712 -0.555451
H  2.742999 2.474226 1.036114
H  -2.856895 0.284806 -2.310128
H  -1.753309 -0.144422 1.867228
H  5.77515 -0.564247 0.352737
H  5.128267 1.740503 1.159054
H  -5.271296 0.442017 -1.660652
H  -4.167951 -0.00438 2.51962
H  -5.935877 0.291969 0.75917
