program: Gaussian 09
title: 000022223
version: EM64L-G09RevD.01
frameworkgroup: C1[X(C3H7NO3)]
method: RPBEPBE
basis: SDD
operation: Freq
keyword: #pfreq=noraman
keyword: PBEPBE/SDD
title: #p freq=noraman PBEPBE/SDD
converged: NO YES NO NO
title: Mulliken charges:
elementType: O O O N C C C H H H H H H H
charge: -0.275957 -0.265451 -0.213602 -0.475883 -0.301410 0.235003 -0.500870 0.237260 0.237464 0.243382 0.234739 0.243495 0.300979 0.300852
chargesum: 0.00000
title: Mulliken charges with hydrogens summed into heavy atoms:
elementType: O O O N C C C
charge: -0.275957 -0.265451 -0.213602 0.125948 0.173313 0.235003 0.220747
polarizability: 7.19610049e+01 8.19274459e-01 4.64972673e+01 2.47728624e-02 4.39525418e-02 3.69130479e+01
1716.lowfreq: -0.0005 0.0007 0.0010 1.9274 6.3329 12.4105 19.1938 51.2654 90.0504
frequency: 17.2063 51.2047 90.0365 145.6265 160.4731 194.7031 280.6439 350.9658 405.6324 552.4324 661.7800 789.8190 858.4356 921.3817 990.4316 997.3799 1112.4256 1129.4608 1148.3195 1149.8991 1165.3730 1215.2739 1344.0788 1422.8355 1452.8647 1452.9766 1465.7352 1607.2202 1673.7327 2985.3687 3006.2608 3037.2929 3107.4157 3153.9295 3322.7538 3460.9304
redmass: 3.0727 3.2282 1.0766 4.4137 3.0552 1.1577 4.6441 6.5991 5.5280 3.2249 4.9054 5.4989 5.4153 4.2357 4.1962 1.9253 1.2622 3.3626 1.5253 2.0851 1.0727 1.1248 1.5087 1.1795 1.0497 1.0693 1.0508 1.0710 9.7755 1.0565 1.0297 1.1042 1.1047 1.1047 1.0415 1.0990
irintensity: 0.3663 0.0059 0.4056 4.8755 18.1256 75.7455 17.6581 3.5959 2.5570 9.7489 22.0066 3.5205 32.9831 31.5020 78.7625 0.3723 0.0538 303.4754 7.2530 44.9541 0.2760 0.3722 13.3642 17.9425 14.5609 23.6340 12.6603 21.8246 177.0873 31.7198 30.0194 22.2148 28.0913 15.7940 2.9554 0.1191
temp: 298.150 k
press: 1.00000 atm
elementType: 8 8 8 7 6 6 6 1 1 1 1 1 1 1
symmnumber: 1
zpe: 280418.4 jmol-1
zpe.correction: 0.106806 hartree
zpe.thermalcorrener: 0.115833 hartree
zpe.thermalcorrenthalpy: 0.116777 hartree
zpe.thermalcorrgfe: 0.071116 hartree
zpe.sumelectzpe: -398.287571 hartree
zpe.sumelectthermal: -398.278544 hartree
zpe.sumelectthermalent: -398.277600 hartree
zpe.sumelectthermalfe: -398.323260 hartree
dipole: 0.1159 -1.6099 0.0018
dipole: 1.6140
quadrupole: -24.1163 -49.2344 -38.5352
quadrupole: 2.5848 -0.0406 0.0452
quadrupole: 13.1790 -11.9391 -1.2399 2.5848 -0.0406 0.0452
hfenergy: -398.3943765 hartree
pointgroup: C01 [X(C3H7N1O3)]
dipole: 0.0487743 0.6331313 -0.0021599 debye
dipolederiv: -1.382644 0.2806891 0.001797 0.4129353 -0.6773181 -0.0008723 0.0003537 0.0004274 -0.3036165 -0.5049916 0.1073623 -0.0018265 -0.0111287 -0.272062 -0.0007123 0.0002394 -0.0006409 -0.3453962 -0.5887407 -0.1525738 0.0012155 0.2291309 -0.9348915 0.0017089 0.0016168 0.0000178 -0.2982549 -0.0689952 -0.0499225 0.0010306 0.0502274 -0.2942193 0.0042601 -0.0009764 0.0037644 -0.049563 0.3558641 -0.2008361 0.003505 -0.4947502 0.1220869 0.0026491 0.0110669 0.0038249 0.3853565 1.4501172 -0.1221824 -0.0044532 -0.5220832 1.3438457 -0.0017485 -0.0063226 -0.0018458 0.2037779 0.636174 -0.0321203 -0.0000573 0.0832455 0.2134024 0.0001855 -0.000007 -0.0000344 0.2809959 0.0063693 0.0188256 -0.0060585 0.0912076 0.0097082 -0.0820919 0.0203329 -0.1123764 -0.0453509 0.0051453 0.0180163 0.0055898 0.0902434 0.0154695 0.0800545 -0.0239327 0.1102122 -0.0507453 -0.0031571 0.0053121 0.0071226 -0.0891137 0.047056 -0.1027414 -0.0465023 -0.08519 -0.0579767 -0.0205705 0.0788868 0.0000087 0.1227663 -0.0351409 0.0000747 -0.0001295 0.000111 0.1224719 -0.0030563 0.0053122 -0.0068972 -0.0891695 0.047405 0.1026308 0.0466044 0.0849911 -0.0580525 0.0593681 0.0227238 0.0670708 0.0639568 0.2032863 -0.148101 0.033594 -0.0996304 0.1125065 0.0591176 0.020507 -0.0680472 0.0625322 0.2113718 0.1447037 -0.0359376 0.0963689 0.1038472 unknown
polarizability: 71.9521473|-0.9466858|46.5062541|-0.035522|0.0226093|36.9129187 unknown
InChI: InChI=1S/C3H7NO3/c1-6-3(5)2-7-4/h2,4H2,1H3
charge 0 multiplicity 1
14 atoms
O  -1.579537 0.773798 0.003526
O  1.850092 -0.436757 0.010374
O  -0.745293 -1.409144 0.003333
N  3.144663 0.324573 -0.001721
C  0.778715 0.56312 -0.004747
C  -0.549811 -0.179335 0.003538
C  -2.957748 0.221332 0.003815
H  0.83825 1.227675 0.87889
H  0.840758 1.202118 -0.907096
H  -3.120418 -0.397911 -0.894193
H  -3.611982 1.103647 0.00323
H  -3.120381 -0.396719 0.902625
H  3.633833 -0.039094 -0.839298
H  3.633759 -0.010405 0.847825
