program: Gaussian 09
title: 000234632
version: EM64L-G09RevD.01
frameworkgroup: C1[X(C7H8N6O)]
method: RPBEPBE
basis: SDD
operation: Freq
keyword: #pfreq=noraman
keyword: PBEPBE/SDD
title: #p freq=noraman PBEPBE/SDD
converged: NO YES NO NO
title: Mulliken charges:
elementType: O N N N N N N C C C C C C C H H H H H H H H
charge: -0.258752 -0.161918 -0.081872 -0.129405 -0.060267 -0.605605 -0.613264 0.204319 -0.467207 -0.082542 -0.216287 0.173854 0.215212 -0.351168 0.264044 0.244920 0.274456 0.247537 0.337204 0.348310 0.388143 0.330289
chargesum: 0.00000
title: Mulliken charges with hydrogens summed into heavy atoms:
elementType: O N N N N N N C C C C C C C
charge: -0.258752 -0.161918 -0.081872 -0.129405 -0.060267 0.079909 0.105168 0.204319 0.041756 -0.082542 0.058169 0.173854 0.215212 -0.103631
polarizability: 1.66497711e+02 -8.75839999e+00 1.28039916e+02 8.19778314e+00 3.04613512e+00 6.20180258e+01
1716.lowfreq: -9.6632 -6.9210 -4.2668 -0.0001 0.0006 0.0009 48.6552 74.9427 97.1418
frequency: 48.6393 74.9378 97.1412 153.4382 184.1578 218.3593 265.8309 284.9573 322.1463 385.2960 473.9526 513.7038 534.5961 545.0829 548.7398 553.7761 556.0768 605.9127 642.8349 666.0327 669.1609 700.8197 779.9154 790.8353 822.3040 840.2336 859.1891 861.0838 930.3646 942.4983 960.6571 1028.9262 1104.5773 1146.7714 1173.3926 1227.2138 1234.0253 1295.4273 1314.7883 1325.3140 1333.9972 1352.4769 1374.9349 1385.0600 1428.9733 1453.8336 1478.3011 1546.1717 1581.2660 1625.3282 1639.4821 1657.6648 3014.9095 3117.7202 3168.8123 3224.6815 3234.5517 3537.0491 3599.7194 3691.1352
redmass: 7.0458 5.7645 5.4894 5.8083 4.2636 5.0713 4.8111 3.9483 6.2147 2.8933 3.0837 8.9929 1.2577 4.1084 3.0313 1.0602 3.5051 2.4639 4.1756 5.7745 2.3298 6.8875 4.7891 4.7097 1.6564 1.3195 3.3081 7.4590 1.4287 2.1245 2.4853 4.5552 2.1436 1.9993 2.1575 2.5441 2.0721 6.5352 1.5771 2.4831 2.6714 3.5544 1.7726 6.8354 2.1691 1.5957 2.7177 7.0577 1.8821 1.5362 2.3822 3.4812 1.0647 1.0992 1.0921 1.0698 1.0989 1.0445 1.0869 1.1056
irintensity: 3.9749 4.1557 5.6825 6.8400 5.8819 9.6397 4.9141 6.5396 5.3183 5.6994 11.8041 4.1747 255.7088 2.5791 4.9713 0.0353 9.7107 37.6231 54.7569 7.1103 121.3833 2.2863 2.7680 17.7213 21.7202 163.7697 28.0323 7.0392 10.7686 19.3205 9.1149 8.8323 24.6655 9.9794 22.6995 26.1592 16.6646 70.8507 4.3504 72.9637 10.2935 81.7573 21.6736 10.4338 38.4230 23.3774 25.0215 54.7453 39.7514 436.8227 334.7801 296.6347 17.2573 2.8442 15.3863 534.1945 0.1001 134.8745 66.9511 53.1533
temp: 298.150 k
press: 1.00000 atm
elementType: 8 7 7 7 7 7 7 6 6 6 6 6 6 6 1 1 1 1 1 1 1 1
symmnumber: 1
zpe: 431428.3 jmol-1
zpe.correction: 0.164322 hartree
zpe.thermalcorrener: 0.175762 hartree
zpe.thermalcorrenthalpy: 0.176706 hartree
zpe.thermalcorrgfe: 0.126411 hartree
zpe.sumelectzpe: -674.307663 hartree
zpe.sumelectthermal: -674.296224 hartree
zpe.sumelectthermalent: -674.295279 hartree
zpe.sumelectthermalfe: -674.345575 hartree
dipole: -3.1347 0.0221 0.9717
dipole: 3.2819
quadrupole: -86.9124 -76.8177 -81.1862
quadrupole: 6.4247 8.3615 -3.8095
quadrupole: -5.2736 4.8210 0.4526 6.4247 8.3615 -3.8095
hfenergy: -674.4719857 hartree
pointgroup: C01 [X(C7H8N6O1)]
dipole: 1.2590507 -0.1320003 0.2540553 debye
dipolederiv: -1.0731202 0.3272619 -0.0417433 0.2644702 -0.6205659 -0.0737365 -0.286973 0.0300505 -0.4266246 -0.6104145 0.0708924 0.1173425 -0.1694177 -0.4171185 -0.0052547 0.0534255 -0.054825 -0.2022641 -0.6390455 -0.0393892 0.0740961 0.0053403 -0.3769038 -0.0066223 0.1433183 0.0089736 -0.2617176 -0.9617268 0.1007125 0.146169 0.1327795 -0.650199 -0.0307699 0.0787578 -0.0175885 -0.245746 -0.8351406 -0.0606255 0.1411818 -0.5826894 -0.6633746 0.1594154 0.1789917 0.0073852 -0.2827509 -1.3962662 -0.3384233 0.1882278 -0.5826674 -0.3301141 0.1752314 0.2105898 0.1150396 -0.7257614 -0.807874 0.0523369 0.1271104 0.291065 -0.9420995 -0.0365455 0.1399076 -0.1103252 -0.5466627 0.5683308 -0.2610891 -0.1162767 -0.1076733 0.3889943 0.0486824 -0.1018839 0.0973151 0.1449699 0.3841845 -0.0112505 -0.2100788 -0.0022693 0.1188853 -0.0957546 -0.2994446 -0.0913305 0.1916145 -0.6577294 -0.1221198 0.1796461 -0.0326863 0.1135302 -0.0178559 0.2132525 0.0343794 -0.0522634 0.4813507 0.2063575 -0.1385008 0.4819546 0.3201967 -0.0960953 -0.145819 -0.0653982 -0.0313103 1.6958203 0.3735274 -0.41781 0.6402906 0.608803 -0.1723279 -0.4482887 -0.1123789 0.3501204 1.1941364 -0.4510747 0.2178424 -0.4973616 1.0888349 0.3157088 0.4320168 0.2894896 0.4224866 0.9287142 -0.0501951 -0.2749361 0.0416227 0.5214456 -0.026305 -0.3074509 0.0328454 0.0212937 -0.0036149 -0.0024483 -0.0452727 -0.0601901 0.0340838 0.1213403 0.026553 0.0461956 -0.0083353 0.0310763 0.0031654 0.0201346 0.0366928 -0.0282033 -0.0686005 0.0079883 -0.0186716 0.1039468 0.0571649 0.064778 0.0412644 0.0338584 0.0706936 -0.0123732 0.0302831 -0.0210236 0.1642926 0.0869513 -0.0180403 0.0093349 -0.0094473 -0.0772623 0.00026 0.0119361 -0.0063194 0.1247729 0.3084215 0.0018513 0.0267313 -0.0312083 0.1718624 0.0039885 0.0235584 -0.005205 0.372013 0.2616596 0.0395249 0.0413008 0.1119585 0.2084383 -0.0352753 0.0389033 -0.0156629 0.366545 0.8170214 0.0654736 -0.0058736 -0.0118971 0.2268038 -0.0704477 0.1048108 -0.0768097 0.2635719 0.1701002 0.0487741 -0.0798899 0.0474752 0.2332692 -0.0766626 -0.1044329 -0.0661354 0.257809 unknown
polarizability: 162.7769197|-8.8643716|128.4905399|-18.9400218|7.9067119|65.2881939 unknown
InChI: InChI=1S/C7H8N6O/c8-4(14)1-13-3-12-5-6(9)10-2-11-7(5)13/h2-3H,1,8-9H2
charge 0 multiplicity 1
22 atoms
O  -4.363996 0.635788 -0.156853
N  -0.94594 0.87813 0.680744
N  0.959754 2.031377 0.103057
N  -0.122264 -1.44599 0.339712
N  2.227447 -1.497633 -0.372383
N  3.506192 0.455117 -0.730587
N  -2.912451 -1.186827 -0.371058
C  0.0131 -0.084208 0.352901
C  -2.309013 0.627798 1.183923
C  1.180661 0.645409 0.004284
C  -0.318438 2.126509 0.512535
C  2.322083 -0.123081 -0.37099
C  -3.291024 0.032121 0.13822
C  1.038441 -2.071629 -0.029169
H  -2.241487 -0.054995 2.051197
H  -2.739893 1.583957 1.51642
H  -0.845592 3.059996 0.699088
H  1.009268 -3.16454 -0.060279
H  4.28888 -0.141329 -0.991863
H  3.59453 1.469406 -0.738904
H  -2.004928 -1.617833 -0.110366
H  -3.52063 -1.627246 -1.06193
