program: Gaussian 09
title: 000234630
version: EM64L-G09RevD.01
frameworkgroup: C1[X(C5H12N4O6S2)]
method: RPBEPBE
basis: SDD
operation: Freq
keyword: #p
keyword: freq=noraman
keyword: PBEPBE/SDD
title: #p freq=noraman PBEPBE/SDD
converged: YES YES NO NO
title: Mulliken charges:
elementType: S S O O O O O O N N N N C C C C C H H H H H H H H H H H H
charge: 1.046555 1.046762 -0.511566 -0.477963 -0.511861 -0.477822 -0.244647 -0.244704 -0.308165 -0.308045 0.096308 0.096334 -0.304360 -0.409222 -0.409146 -0.719989 -0.720047 0.242070 0.241663 0.274792 0.292219 0.292018 0.274867 0.289947 0.298892 0.283145 0.289831 0.299021 0.283109
chargesum: 0.00000
title: Mulliken charges with hydrogens summed into heavy atoms:
elementType: S S O O O O O O N N N N C C C C C
charge: 1.046555 1.046762 -0.511566 -0.477963 -0.511861 -0.477822 -0.244647 -0.244704 -0.308165 -0.308045 0.096308 0.096334 0.179373 0.157789 0.157740 0.151995 0.151915
polarizability: 1.86381722e+02 -7.91703045e-03 1.90324856e+02 -2.33289951e+00 -3.59049853e-02 1.22811775e+02
1716.lowfreq: -12.3833 -11.2928 -3.6975 -0.0021 -0.0011 -0.0005 14.5939 17.6509 32.9851
frequency: 14.2817 17.6483 32.7141 36.2535 43.1823 79.7354 87.5158 93.5834 132.0278 161.8220 162.2331 174.1107 174.2288 199.6490 210.7211 212.6478 227.5231 229.1693 239.6317 265.9233 286.8015 306.8336 310.5679 324.4714 336.7806 339.0791 368.3246 384.9039 397.3353 459.5321 482.8133 567.1883 568.2353 703.5952 714.5402 722.0123 763.3687 821.4912 828.6177 875.1573 885.4773 915.4921 916.4420 978.4949 992.1283 998.1028 1030.3314 1035.1150 1035.7336 1062.9576 1080.9562 1088.5392 1211.9575 1251.4974 1300.0202 1301.1855 1315.6792 1317.7347 1318.6855 1342.4861 1356.3325 1359.5651 1405.8455 1405.8866 1412.3491 1412.3973 1440.2748 1441.8905 1455.1763 2987.6854 2989.8487 3017.4970 3041.3565 3041.3767 3054.7522 3061.0200 3079.7110 3187.7889 3187.7917 3209.4941 3209.5398
redmass: 6.0453 8.9938 7.2685 4.5966 11.5019 9.2501 8.7464 7.2986 10.9477 4.1252 4.9785 1.0503 1.0469 5.9544 4.5628 5.9864 4.8031 4.6794 6.4519 4.0380 7.8309 5.8425 10.0805 4.5824 6.8352 7.8687 3.3325 9.4481 5.0753 2.9022 3.0939 8.7022 8.7860 3.6083 2.9470 4.6741 5.6941 12.8795 12.0211 3.5730 2.2119 2.7994 2.6981 1.6081 1.2879 1.5345 2.2109 2.9182 2.0613 6.2651 4.1001 3.6668 1.2141 1.1916 1.3233 4.1432 3.3732 1.1332 1.2623 1.5606 1.3280 1.1911 1.0523 1.0520 1.0531 1.0531 1.0801 1.0791 1.0810 1.0596 1.0600 1.0634 1.0251 1.0251 1.1038 1.1021 1.1019 1.1073 1.1073 1.1081 1.1081
irintensity: 14.9832 1.0893 0.5691 4.2279 0.4062 0.2171 1.1279 0.4104 0.0630 17.1349 17.8029 0.3682 0.0306 4.7713 1.3713 0.0944 12.0518 0.6723 0.0569 5.3454 1.0905 9.0125 0.3834 6.9377 54.3831 22.4804 19.6069 15.2646 132.6478 6.7689 16.2163 26.7021 52.3832 9.5299 60.8019 11.1399 184.8505 79.1259 58.6635 33.4464 19.8958 12.4276 51.5811 10.3386 61.3324 2.1655 2.9787 116.2817 117.1362 132.7766 20.2645 10.7342 0.9475 27.3413 24.2189 60.9737 54.1976 8.6859 2.8983 10.4165 3.2282 12.2421 5.8975 24.9777 1.3157 26.2456 44.8559 0.4810 16.6266 42.5610 3.7716 6.5758 1.6723 0.2354 12.3283 0.3937 5.7306 1.0195 0.0987 0.3016 0.3110
temp: 298.150 k
press: 1.00000 atm
elementType: 16 16 8 8 8 8 8 8 7 7 7 7 6 6 6 6 6 1 1 1 1 1 1 1 1 1 1 1 1
symmnumber: 1
zpe: 511360.8 jmol-1
zpe.correction: 0.194767 hartree
zpe.thermalcorrener: 0.216502 hartree
zpe.thermalcorrenthalpy: 0.217446 hartree
zpe.thermalcorrgfe: 0.140929 hartree
zpe.sumelectzpe: -1662.346601 hartree
zpe.sumelectthermal: -1662.324866 hartree
zpe.sumelectthermalent: -1662.323922 hartree
zpe.sumelectthermalfe: -1662.400438 hartree
dipole: 0.0040 -0.5445 0.0047
dipole: 0.5446
quadrupole: -96.5593 -135.1346 -116.9816
quadrupole: -0.0008 -18.3633 0.0591
quadrupole: 19.6659 -18.9094 -0.7565 -0.0008 -18.3633 0.0591
hfenergy: -1662.5413676 hartree
pointgroup: C01 [X(C5H12N4O6S2)]
dipole: -0.0022623 0.2142162 -0.0031573 debye
polarizability: 177.4848344|-0.2686559|190.3187698|-22.1772389|-0.564325|131.7147493 unknown
InChI: InChI=1S/C5H12N4O6S2/c1-16(12,13)8(6-10)4-3-5-9(7-11)17(2,14)15/h3-5H2,1-2H3
charge 0 multiplicity 1
29 atoms
S  2.119021 1.104539 -0.786372
S  -2.163658 1.051072 0.775159
O  1.55157 1.321285 0.717754
O  1.600539 2.017725 -2.012435
O  -1.606702 1.271353 -0.732386
O  -1.667627 1.988356 1.992243
O  2.649006 -2.720027 -1.845593
O  -2.58619 -2.776443 1.870352
N  1.773989 -0.769477 -1.199089
N  -1.766251 -0.80974 1.200905
N  2.905674 -1.495804 -1.539058
N  -2.87663 -1.562266 1.554254
C  0.01855 -2.126713 -0.000029
C  0.380578 -1.284743 -1.249297
C  -0.359853 -1.288839 1.247124
C  4.02715 1.108206 -0.745326
C  -4.071159 1.001416 0.739802
H  0.869829 -2.781716 0.258957
H  -0.819807 -2.798735 -0.257556
H  0.315217 -1.912166 -2.157994
H  -0.295968 -0.416354 -1.365578
H  0.295127 -0.40334 1.357177
H  -0.275184 -1.910548 2.158155
H  4.326133 0.376134 0.014421
H  4.364336 0.828455 -1.750156
H  4.282946 2.142346 -0.471353
H  -4.351694 0.256295 -0.014292
H  -4.397594 0.719056 1.747428
H  -4.35635 2.026174 0.459688
