program: Gaussian 09
title: 000234629
version: EM64L-G09RevD.01
frameworkgroup: C1[X(C7H16N4O6S2)]
method: RPBEPBE
basis: SDD
operation: Freq
keyword: #p
keyword: freq=noraman
keyword: PBEPBE/SDD
title: #p freq=noraman PBEPBE/SDD
converged: YES YES NO NO
title: Mulliken charges:
elementType: S S O O O O O O N N N N C C C C C C C H H H H H H H H H H H H H H H H
charge: 1.020418 1.020291 -0.494132 -0.516900 -0.494212 -0.516916 -0.243177 -0.243240 -0.273555 -0.273527 0.098417 0.098425 -0.374214 -0.330282 -0.330368 -0.607327 -0.607049 -0.587027 -0.586931 0.219562 0.219593 0.240566 0.254164 0.254140 0.240613 0.288746 0.315508 0.315546 0.288657 0.268583 0.266307 0.267234 0.268585 0.266338 0.267164
chargesum: 0.00000
title: Mulliken charges with hydrogens summed into heavy atoms:
elementType: S S O O O O O O N N N N C C C C C C C
charge: 1.020418 1.020291 -0.494132 -0.516900 -0.494212 -0.516916 -0.243177 -0.243240 -0.273555 -0.273527 0.098417 0.098425 0.064942 0.164448 0.164386 -0.003074 -0.002846 0.215096 0.215156
polarizability: 2.67976946e+02 3.05670771e-02 1.77521222e+02 1.37674790e+00 2.33874389e-03 1.59710247e+02
1716.lowfreq: -18.0278 -4.4304 -0.0020 -0.0017 -0.0016 1.6376 7.5238 8.6114 21.4809
frequency: -5.7893 7.4225 21.4678 30.1588 42.5784 47.4169 53.5395 59.5935 86.1054 97.5708 111.6601 115.1929 116.7392 147.2482 159.3580 160.2903 169.4730 200.5675 212.9945 214.7394 215.2317 215.8932 242.9570 274.3828 276.5251 279.0209 304.8596 305.3465 359.5747 363.4444 363.6221 386.8529 399.0223 467.6544 475.3653 570.9923 601.7630 735.6728 735.8251 751.1825 767.3077 795.3990 796.3644 811.9724 833.1984 835.4532 905.8452 946.0886 971.5073 1008.6773 1013.9849 1059.0954 1064.6151 1072.8145 1074.1776 1077.6213 1095.6007 1105.9627 1106.6715 1152.1321 1152.2616 1207.9638 1214.4658 1232.2030 1269.1070 1294.2810 1297.1246 1301.1862 1317.7555 1317.8235 1346.8303 1352.8234 1405.7363 1405.7548 1421.8000 1422.2200 1448.6502 1448.6850 1455.8231 1455.9286 1470.2394 1474.2547 1487.4908 2978.0654 2989.2879 2989.3449 3001.3559 3005.2022 3028.1734 3042.2570 3042.4693 3063.2765 3074.7421 3089.6950 3089.7226 3105.3754 3105.4779 3138.5302 3138.8032
redmass: 4.2085 12.6312 7.1875 4.0857 2.2223 4.2511 5.4815 5.4515 6.8434 3.2425 8.7827 6.2318 2.0442 5.9823 1.1650 1.0869 4.4737 7.9360 4.9830 5.1983 4.8539 4.5099 4.8424 5.7945 6.4823 6.1736 5.5867 5.4332 7.9028 7.1101 7.1486 9.6025 5.5076 7.3438 12.6871 7.4793 4.9548 3.8130 3.8294 1.0770 1.1504 6.2741 6.3497 1.3943 14.2682 8.5194 1.8489 4.8804 2.7908 4.5764 4.9362 2.8194 1.4875 1.6026 1.3930 2.6147 1.2474 4.8270 3.9404 2.0057 2.0077 1.2595 1.3809 1.1992 1.2410 1.2607 1.0480 1.1410 11.0644 9.3391 1.2941 1.3910 1.1500 1.1501 1.1037 1.1084 1.0451 1.0451 1.0437 1.0436 1.0696 1.0911 1.0994 1.0585 1.0303 1.0303 1.0594 1.0586 1.1023 1.0555 1.0555 1.1050 1.1055 1.1020 1.1020 1.1022 1.1023 1.1115 1.1114
irintensity: 1.3820 0.6333 0.9386 0.2274 2.8934 11.6615 2.8406 0.4120 1.0601 1.2890 0.0638 0.7214 0.0664 1.4579 5.0555 0.2486 47.4368 0.1378 5.7101 0.0267 1.0727 0.4713 20.4223 26.6837 0.2981 1.8356 0.6312 11.4203 59.7240 5.4253 0.6985 4.4458 2.1925 56.5716 246.9227 2.9808 0.7902 2.4067 5.5220 9.4290 0.1873 184.0459 192.4953 5.2332 115.5654 12.7280 12.2638 118.5576 8.3661 1.8807 3.3828 10.9425 30.2932 12.7372 4.2332 1.7390 9.5047 99.1426 95.6374 13.3083 3.5883 6.6679 12.1568 11.1582 0.6572 42.9626 0.0114 11.4682 52.3031 49.1514 0.0685 7.9446 42.8732 16.3815 2.0345 11.0204 18.4417 20.7741 38.4878 4.0769 0.0004 0.7060 22.8323 11.6574 10.7371 6.7049 5.1893 15.8458 7.1460 2.9295 1.3062 0.8549 25.4918 9.7132 9.5023 0.1483 0.1454 1.0919 2.0200
temp: 298.150 k
press: 1.00000 atm
elementType: 16 16 8 8 8 8 8 8 7 7 7 7 6 6 6 6 6 6 6 1 1 1 1 1 1 1 1 1 1 1 1 1 1 1 1
symmnumber: 1
zpe: 657682.8 jmol-1
zpe.correction: 0.250498 hartree
zpe.thermalcorrener: 0.274807 hartree
zpe.thermalcorrenthalpy: 0.275752 hartree
zpe.thermalcorrgfe: 0.191741 hartree
zpe.sumelectzpe: -1740.802191 hartree
zpe.sumelectthermal: -1740.777882 hartree
zpe.sumelectthermalent: -1740.776938 hartree
zpe.sumelectthermalfe: -1740.860948 hartree
dipole: -0.0025 2.9804 -0.0056
dipole: 2.9804
quadrupole: -139.8568 -150.8009 -143.6875
quadrupole: 0.0251 -21.1335 -0.0064
quadrupole: 4.9249 -6.0192 1.0943 0.0251 -21.1335 -0.0064
hfenergy: -1741.0526891 hartree
pointgroup: C01 [X(C7H16N4O6S2)]
dipole: 0.0021341 -1.1724964 0.0150797 debye
polarizability: 267.0159275|0.2504665|177.5179827|10.2447325|-0.2374612|160.6745048 unknown
InChI: InChI=1S/C7H16N4O6S2/c1-10(8-12)18(14,15)6-4-3-5-7-19(16,17)11(2)9-13/h3-7H2,1-2H3
charge 0 multiplicity 1
35 atoms
S  -4.0247 0.540314 -0.803343
S  4.032065 0.57007 0.801203
O  -4.04387 1.671487 0.352527
O  -4.253112 0.953361 -2.356136
O  4.049378 1.667131 -0.387218
O  4.259798 1.028578 2.341178
O  -6.143574 -2.421677 0.83069
O  6.154605 -2.43677 -0.743186
N  -5.421153 -0.781894 -0.487435
N  5.430871 -0.7582 0.524137
N  -5.170262 -1.615893 0.583396
N  5.180063 -1.625459 -0.519915
C  0.004551 -0.570138 0.014829
C  -1.236071 0.309002 -0.297565
C  1.243233 0.319366 0.304883
C  -2.444713 -0.579654 -0.582285
C  2.45367 -0.559058 0.612461
C  -6.660283 -0.726521 -1.282158
C  6.671133 -0.676138 1.314824
H  -0.209626 -1.217403 0.888241
H  0.220197 -1.238797 -0.841922
H  -1.020102 0.959684 -1.165473
H  -1.45246 0.965375 0.565991
H  1.458444 0.953768 -0.575283
H  1.025653 0.991707 1.155698
H  -2.407283 -1.126974 -1.537869
H  -2.733129 -1.234647 0.255525
H  2.742878 -1.235825 -0.207544
H  2.418513 -1.080162 1.582667
H  -7.510998 -0.404612 -0.656316
H  -6.877596 -1.726763 -1.696007
H  -6.492594 -0.011413 -2.105744
H  7.520299 -0.372596 0.677792
H  6.890707 -1.662703 1.759164
H  6.503771 0.063956 2.116091
