program: Gaussian 09
title: 000234628
version: EM64L-G09RevD.01
frameworkgroup: C1[X(C14H13N5)]
method: RPBEPBE
basis: SDD
operation: Freq
keyword: #pfreq=noraman
keyword: PBEPBE/SDD
title: #p freq=noraman PBEPBE/SDD
converged: YES YES NO NO
title: Mulliken charges:
elementType: N N N N N C C C C C C C C C C C C C C H H H H H H H H H H H H H
charge: -0.094137 -0.143320 -0.036609 -0.064584 -0.043524 -0.396271 -0.398832 0.107221 -0.098813 0.148351 -0.577484 -0.222013 0.500178 -0.384845 -0.420705 -0.359420 -0.221305 -0.228904 -0.234375 0.243138 0.249001 0.246633 0.245997 0.261340 0.227206 0.265182 0.243524 0.228109 0.270191 0.228086 0.229647 0.231337
chargesum: 0.00000
title: Mulliken charges with hydrogens summed into heavy atoms:
elementType: N N N N N C C C C C C C C C C C C C C
charge: -0.094137 -0.143320 -0.036609 -0.064584 -0.043524 0.095868 0.093798 0.107221 -0.098813 0.148351 -0.088939 0.043169 0.500178 -0.141321 -0.192597 -0.089229 0.006781 0.000743 -0.003038
polarizability: 2.46899833e+02 -1.50055872e+01 1.76015025e+02 -8.56290513e+00 6.00115966e+00 1.26155411e+02
1716.lowfreq: -7.5562 -0.0008 -0.0006 -0.0006 5.7285 7.2041 22.5996 31.1397 43.4432
frequency: 18.3476 31.1191 43.0223 75.3612 86.6498 134.5817 153.9635 190.4762 195.0805 225.6526 283.2597 319.7450 327.1664 380.1228 404.8158 434.9369 459.6589 531.3451 550.3343 588.1631 598.6274 617.8625 641.5671 657.6172 666.4004 703.7527 718.8918 778.0805 786.8216 789.2537 806.6172 812.6003 827.7882 859.5274 861.9412 923.5318 924.5326 926.6838 952.0479 982.9959 986.0898 989.6602 1001.8495 1002.1518 1027.7385 1079.8276 1094.7504 1104.3762 1107.0781 1117.5866 1127.5432 1140.7876 1173.9925 1178.4647 1189.6682 1196.1477 1214.1192 1242.5584 1293.2995 1308.7124 1317.2735 1338.6672 1364.1310 1368.9843 1386.3866 1390.6100 1428.9364 1444.9205 1461.9246 1463.5544 1473.1935 1485.3156 1490.6138 1536.1299 1575.3831 1596.5952 1615.2674 3017.7341 3076.8658 3080.2996 3087.8928 3114.3249 3124.4152 3135.1741 3147.7798 3162.9926 3164.6334 3183.6794 3199.4433 3228.5645
redmass: 4.6811 5.2502 4.2028 3.3193 5.6724 3.0187 4.9517 4.4107 4.6113 5.3922 5.2467 7.2543 2.4187 3.4690 2.8210 6.6583 3.7762 5.5191 3.6706 5.7939 5.5044 6.3609 5.4316 6.8733 7.3273 2.9558 1.8162 2.9281 1.1080 3.6629 5.4596 2.7782 2.1764 1.2473 6.1019 5.8577 1.5200 1.4645 1.8301 1.3833 2.2664 5.9872 1.3231 1.4330 2.2339 1.7261 1.3522 1.5955 2.1073 1.6061 2.1063 1.7288 1.0642 2.7314 1.1375 2.2913 2.7071 2.1370 6.6038 3.8506 2.2295 1.5377 1.9541 2.2947 5.6326 1.8217 3.3610 2.1815 1.3868 1.0871 1.5126 2.1320 2.2861 8.0481 10.8305 6.1166 6.0391 1.0594 1.1049 1.0485 1.0605 1.0881 1.0872 1.0913 1.0959 1.0920 1.1014 1.1188 1.1175 1.0982
irintensity: 0.5772 1.0687 0.2013 3.9018 6.2176 1.0356 3.8218 1.3972 12.2451 1.4179 12.1284 0.3181 3.6641 2.3308 0.1848 5.4381 4.5645 6.7527 5.3815 6.5946 1.8076 0.2606 28.6907 6.4054 9.5416 7.4596 131.6457 7.5430 19.6768 24.4986 0.4440 12.0613 4.6834 0.2581 9.2989 6.9806 0.1850 12.0716 8.6436 0.7888 30.5819 0.6332 0.2695 13.3383 8.1833 19.2839 4.0064 1.6050 8.4112 25.0047 7.7697 0.0720 0.9516 50.9795 1.8922 15.1069 17.0562 18.0920 72.6267 91.6470 19.9261 37.4127 18.4553 17.8726 1.9109 0.4014 112.7521 10.2725 44.4907 7.1101 22.2973 35.2791 11.3983 63.7693 692.8331 1.1898 2.3716 29.8470 4.0907 17.1428 44.6946 9.6597 0.0136 7.1094 28.5060 19.2294 27.5368 0.8642 27.2311 0.0815
temp: 298.150 k
press: 1.00000 atm
elementType: 7 7 7 7 7 6 6 6 6 6 6 6 6 6 6 6 6 6 6 1 1 1 1 1 1 1 1 1 1 1 1 1
symmnumber: 1
zpe: 653813.2 jmol-1
zpe.correction: 0.249024 hartree
zpe.thermalcorrener: 0.264283 hartree
zpe.thermalcorrenthalpy: 0.265227 hartree
zpe.thermalcorrgfe: 0.204044 hartree
zpe.sumelectzpe: -813.668500 hartree
zpe.sumelectthermal: -813.653242 hartree
zpe.sumelectthermalent: -813.652297 hartree
zpe.sumelectthermalfe: -813.713481 hartree
dipole: 2.2416 -1.6293 1.4496
dipole: 3.1274
quadrupole: -97.8340 -110.2561 -104.8802
quadrupole: -1.9052 -7.3788 4.5468
quadrupole: 6.4894 -5.9326 -0.5568 -1.9052 -7.3788 4.5468
hfenergy: -813.9175247 hartree
pointgroup: C01 [X(C14H13N5)]
dipole: -0.848532 0.4190999 0.7863105 debye
polarizability: 246.3080718|-18.0007373|174.5620733|-0.9036513|12.2570892|128.2001243 unknown
InChI: InChI=1S/C14H13N5/c1-2-4-11(5-3-1)8-19-10-17-12-13(18-6-7-18)15-9-16-14(12)19/h1-5,9-10H,6-8H2
charge 0 multiplicity 1
32 atoms
N  4.101431 0.137171 0.20673
N  -0.417387 0.900583 -0.865646
N  2.867708 -1.547871 -0.917285
N  1.415095 1.755448 0.23129
N  0.524313 -1.269185 -1.608386
C  5.060989 -0.598042 1.052368
C  4.379366 0.692107 1.548369
C  2.903017 -0.312102 -0.312925
C  1.723217 0.491019 -0.310728
C  0.591933 -0.058192 -0.985424
C  -1.792085 0.767341 -1.399957
C  0.131233 1.955697 -0.121782
C  -2.792323 0.234363 -0.378654
C  1.708631 -1.948085 -1.523462
C  -3.803435 1.07305 0.149399
C  -2.721004 -1.118379 0.043695
C  -4.730686 0.572153 1.092648
C  -3.644603 -1.618245 0.987007
C  -4.651516 -0.774439 1.514315
H  6.105556 -0.567138 0.727539
H  4.727676 -1.555249 1.470099
H  3.592491 0.60196 2.306288
H  4.9400 1.631323 1.569004
H  -1.714177 0.078175 -2.259686
H  -2.107684 1.756234 -1.776883
H  -0.448622 2.840725 0.132917
H  1.733766 -2.936128 -1.992849
H  -3.870732 2.118273 -0.178659
H  -1.943267 -1.769677 -0.373423
H  -5.510993 1.228104 1.494444
H  -3.584196 -2.664321 1.307358
H  -5.36941 -1.164577 2.244479
