program: Gaussian 09
title: 000234627
version: EM64L-G09RevD.01
frameworkgroup: C1[X(C5H6ClN5O)]
method: RPBEPBE
basis: SDD
operation: Freq
keyword: #p
keyword: freq=noraman
keyword: PBEPBE/SDD
title: #p freq=noraman PBEPBE/SDD
converged: NO YES NO NO
title: Mulliken charges:
elementType: Cl O N N N N N C C C C C H H H H H H
charge: -0.034939 -0.210510 -0.346103 -0.120956 -0.012461 -0.320660 -0.585637 0.291908 -0.259126 -0.015921 -0.143686 -0.017696 0.264653 0.337314 0.328777 0.339577 0.334518 0.170950
chargesum: 0.00000
title: Mulliken charges with hydrogens summed into heavy atoms:
elementType: Cl O N N N N N C C C C C
charge: -0.034939 -0.210510 -0.008789 -0.120956 -0.012461 0.008116 0.088458 0.291908 0.005527 -0.015921 -0.143686 0.153254
polarizability: 1.32835265e+02 7.82450696e+00 1.22726653e+02 8.28881795e+00 5.44862031e+00 6.05387389e+01
1716.lowfreq: -3.6891 -0.0019 -0.0013 0.0019 6.5923 7.8508 31.2720 48.4988 137.0450
frequency: 31.2202 48.4903 137.0444 146.1355 186.3716 189.3405 241.1959 292.1221 294.5605 377.3636 402.0922 460.5995 485.5216 492.2194 532.2100 566.5926 582.7832 607.6479 664.9009 668.6194 766.6919 803.4259 818.4056 873.9795 900.3816 964.1082 970.5972 987.4397 1077.4448 1139.0180 1256.2253 1312.7264 1339.0399 1365.0681 1373.4505 1447.1786 1450.3504 1506.7559 1537.0759 1573.8119 1615.4011 1665.9000 2934.5676 3217.6555 3491.5127 3520.6970 3560.5770 3718.4287
redmass: 12.2033 6.9152 4.4395 6.4931 5.0979 9.5105 4.8361 3.6799 4.2093 12.0498 5.0712 1.6664 1.5941 1.7542 1.0620 4.5615 1.2689 6.5732 4.3316 4.7722 5.3526 5.5310 1.8061 7.2352 7.7676 1.9932 2.3814 2.6971 2.8102 1.5238 3.6456 8.2068 3.2767 1.5282 1.5981 1.5226 2.9504 2.3284 4.7874 5.0922 1.7749 6.1554 1.0877 1.0941 1.0798 1.0770 1.0444 1.1060
irintensity: 3.6040 6.3774 13.6982 0.6781 8.5495 1.8080 14.3051 22.7808 0.8330 19.1905 8.7227 12.1403 198.8047 174.4816 0.3073 15.6106 156.4756 7.3494 20.9013 63.8534 7.0196 1.7556 50.3846 53.1012 5.3394 7.1426 25.9033 33.6173 27.9271 22.4877 56.1711 8.2339 88.2549 41.4072 62.8698 74.8037 89.3725 50.8833 532.5895 517.4455 525.2507 219.0190 108.1818 0.4472 17.3142 55.1763 130.4642 53.3651
temp: 298.150 k
press: 1.00000 atm
elementType: 17 8 7 7 7 7 7 6 6 6 6 6 1 1 1 1 1 1
symmnumber: 1
zpe: 326550.3 jmol-1
zpe.correction: 0.124376 hartree
zpe.thermalcorrener: 0.135677 hartree
zpe.thermalcorrenthalpy: 0.136622 hartree
zpe.thermalcorrgfe: 0.085713 hartree
zpe.sumelectzpe: -1002.284554 hartree
zpe.sumelectthermal: -1002.273254 hartree
zpe.sumelectthermalent: -1002.272309 hartree
zpe.sumelectthermalfe: -1002.323217 hartree
dipole: -1.9888 1.6999 -3.5576
dipole: 4.4160
quadrupole: -72.2394 -65.1819 -79.9787
quadrupole: 14.0186 14.5808 3.6961
quadrupole: 0.2272 7.2847 -7.5120 14.0186 14.5808 3.6961
hfenergy: -1002.4089308 hartree
pointgroup: C01 [X(C5H6Cl1N5O1)]
dipole: -0.6581374 0.6273365 -1.4805028 debye
dipolederiv: -0.241541 0.2670665 -0.0448491 0.2805764 -0.862521 0.1090998 -0.0602566 0.1216208 -0.1164247 -0.4665643 -0.0504891 0.0046783 0.1431193 -0.4251225 -0.2966836 0.439672 -0.1080311 -0.8996804 -0.9953557 0.1082806 -0.155824 0.3450642 -0.0726214 0.0333154 -0.4100229 0.1270146 -0.5562802 -1.3585284 -0.4192335 -0.1656749 -0.2341276 -0.6483962 -0.0090156 -0.2601067 -0.0694173 -0.2974209 -0.7069861 -0.2332877 -0.0806329 -0.4696682 -1.4711039 -0.0082295 -0.0877657 0.0338983 -0.2106158 -0.4868803 0.1933764 0.3222664 0.4194781 -0.2005915 0.2072867 0.5582147 0.0932657 -0.4566934 -0.8470874 -0.6752376 0.0477072 -0.7485527 -1.0296669 -0.1371643 0.0332354 -0.1304831 -0.6989983 1.8184623 0.035966 0.3075853 -0.5476849 0.8239379 -0.1149578 0.4553662 -0.0595776 0.3127554 -0.8584738 0.2259879 -0.1481586 0.5494025 -0.6977255 0.1330601 -0.2147089 0.0700553 -0.23647 1.3543571 0.6937424 0.1954795 0.8119607 1.5769161 0.0810113 0.2293739 0.078869 0.2641658 1.2058437 -0.0904587 0.2447556 -0.1112763 1.7492635 -0.1368403 0.301338 -0.1515904 0.1203782 0.8960233 0.216177 -0.3883061 0.0862019 0.4329525 0.2514822 -0.9088019 0.2044263 1.3469592 0.0751162 -0.0709211 -0.0343718 -0.0802656 0.0410109 0.0110634 -0.0222604 0.0058632 0.1867901 0.0954988 -0.0414078 0.0050187 -0.097426 0.174932 -0.0200447 0.0574626 -0.0757986 0.3293531 0.1559076 -0.1065031 0.0122106 -0.235476 0.1979416 -0.0553238 0.0526115 -0.0562577 0.1457008 0.2868656 0.0754383 -0.0363958 0.0255453 0.1901521 0.0203855 -0.0335812 0.0288965 0.3816015 0.1823726 0.0127949 -0.0545605 0.068762 0.270886 0.0190484 -0.0600194 0.0040688 0.376763 -0.1090302 -0.1412913 -0.0309279 -0.2056329 -0.0502436 -0.0874932 -0.0697506 -0.1168227 0.0081167 unknown
polarizability: 134.209598|7.1508125|121.2154115|9.9793925|-1.1908922|60.6756471 unknown
InChI: InChI=1S/C5H6ClN5O/c6-3-1-4(11-8-2-12)10-5(7)9-3/h1-2,8,11H,7H2
charge 0 multiplicity 1
18 atoms
Cl 2.155372 -2.87375 0.433971
O  -3.354188 0.125006 1.377795
N  -1.546694 0.645136 -0.794306
N  0.592087 1.368729 -0.272722
N  2.398377 -0.183282 0.284077
N  -2.582915 -0.287807 -0.807215
N  2.755693 2.129577 0.212035
C  -0.251238 0.304009 -0.400073
C  0.163896 -1.042886 -0.192828
C  1.884476 1.080545 0.068123
C  1.520266 -1.184889 0.147727
C  -3.43582 -0.480124 0.285059
H  -0.515138 -1.88977 -0.273187
H  -1.793034 1.637635 -0.739072
H  -2.768038 -0.770888 -1.691777
H  3.718265 1.938006 0.47658
H  2.420923 3.078955 0.07279
H  -4.210592 -1.244603 0.042421
