program: Gaussian 09
title: 000234625
version: EM64L-G09RevD.01
frameworkgroup: C1[X(C9H10N4O2)]
method: RPBEPBE
basis: SDD
operation: Freq
keyword: #p
keyword: freq=noraman
keyword: PBEPBE/SDD
title: #p freq=noraman PBEPBE/SDD
converged: YES YES NO NO
title: Mulliken charges:
elementType: O O N N N N C C C C C C C C C H H H H H H H H H H
charge: -0.257243 -0.223530 -0.164264 -0.066005 -0.028415 -0.008546 -0.500468 0.137891 0.049371 -0.173512 0.270654 -0.314160 -0.226399 -0.348809 -0.668094 0.271038 0.302092 0.279417 0.264579 0.237178 0.232780 0.250630 0.217748 0.231298 0.234769
chargesum: 0.00000
title: Mulliken charges with hydrogens summed into heavy atoms:
elementType: O O N N N N C C C C C C C C C
charge: -0.257243 -0.223530 -0.164264 -0.066005 -0.028415 -0.008546 0.072662 0.137891 0.049371 0.105906 0.270654 -0.049580 0.243559 -0.098179 0.015721
polarizability: 1.72875836e+02 7.60228562e+00 1.30036179e+02 1.42870053e+01 -1.60274070e+00 7.72231438e+01
1716.lowfreq: -3.5326 -0.0004 -0.0002 0.0006 1.9428 3.1619 20.2202 22.8523 54.6681
frequency: 20.0279 22.8314 54.6662 62.5855 129.6102 147.7334 188.7873 207.7522 229.0045 249.8316 301.6321 313.9362 377.9371 410.2607 483.5306 536.0832 561.9134 601.0606 623.4492 636.3156 687.0907 745.8298 768.7361 793.9815 799.7814 828.0580 843.4469 858.9626 904.4599 905.5723 947.2165 963.7409 1019.6303 1064.8048 1094.6121 1113.6950 1132.9530 1135.9582 1157.4692 1197.5703 1241.7281 1251.9075 1271.3247 1278.7152 1314.0410 1341.6086 1350.5695 1365.1699 1376.2075 1403.3503 1409.6976 1444.7008 1464.1273 1469.5677 1474.0063 1485.8327 1533.9623 1567.1447 1653.9054 2998.9613 3008.2033 3015.9338 3072.9806 3076.3570 3095.8187 3112.0146 3156.6748 3176.7023 3243.7087
redmass: 4.3932 4.9532 3.1557 5.4558 2.6668 3.7850 6.5344 2.6684 4.0716 1.2469 5.2886 6.8093 3.5783 4.2856 4.7674 4.1148 6.0571 3.7551 6.7461 5.1266 6.3818 5.7737 7.1152 4.4611 1.0981 3.0238 1.8749 5.5543 1.5852 5.0936 1.5028 2.3084 2.2997 3.9861 3.3283 2.3318 3.9279 1.4917 3.8771 1.9537 1.6608 1.1338 5.5525 2.0045 2.6754 2.5764 1.4199 1.5564 2.6109 1.2628 2.0471 1.2598 1.0400 2.7120 1.0953 1.0678 9.2257 7.7700 9.8932 1.0360 1.0615 1.0583 1.1000 1.1068 1.0985 1.1031 1.0934 1.0930 1.0991
irintensity: 0.1063 1.2404 0.3841 0.5110 2.8273 5.2690 2.5573 9.3198 1.2068 1.9995 6.2587 7.8928 6.2881 0.6111 9.3995 3.8418 3.8817 0.2743 4.9226 20.2985 7.9176 10.7599 10.6818 13.8347 4.4029 7.3560 9.9765 13.5534 22.2551 28.4650 0.7882 12.0612 68.1374 12.4350 25.1453 15.7139 185.1873 9.8637 324.4319 31.2329 17.5329 0.1298 17.2827 42.6264 6.4752 28.9740 34.6750 21.9899 20.9965 22.1639 1.4559 38.7038 13.7765 98.0853 1.0780 14.0629 25.5400 69.3984 168.5332 17.7122 29.2640 14.8928 3.5323 5.1356 25.2924 39.7223 11.0490 11.0573 0.4292
temp: 298.150 k
press: 1.00000 atm
elementType: 8 8 7 7 7 7 6 6 6 6 6 6 6 6 6 1 1 1 1 1 1 1 1 1 1
symmnumber: 1
zpe: 495119.0 jmol-1
zpe.correction: 0.188581 hartree
zpe.thermalcorrener: 0.202012 hartree
zpe.thermalcorrenthalpy: 0.202957 hartree
zpe.thermalcorrgfe: 0.145602 hartree
zpe.sumelectzpe: -717.310292 hartree
zpe.sumelectthermal: -717.296860 hartree
zpe.sumelectthermalent: -717.295916 hartree
zpe.sumelectthermalfe: -717.353271 hartree
dipole: 5.8687 -0.6287 1.8765
dipole: 6.1934
quadrupole: -81.4892 -93.0147 -87.0502
quadrupole: -1.3122 -1.4170 4.0808
quadrupole: 5.6955 -5.8300 0.1345 -1.3122 -1.4170 4.0808
hfenergy: -717.4988729 hartree
pointgroup: C01 [X(C9H10N4O2)]
dipole: -2.3249001 -0.0518036 0.7276748 debye
dipolederiv: -1.8331482 0.328319 0.0514737 0.4547378 -0.4050742 -0.0936541 0.005456 -0.0835819 -0.4546722 -0.7624432 0.0275169 -0.0710393 0.2811297 -0.3999439 -0.1852095 0.2082917 -0.2529777 -0.7270648 -0.8341361 -0.1593065 0.0645084 0.148168 -0.4774944 -0.1641509 0.1616987 -0.0687282 -0.2308755 -0.7280249 -0.0237253 0.0583173 -0.1313202 -0.3702627 -0.0000875 0.0766168 -0.0245774 -0.2696067 -0.5450863 -0.0615981 0.060338 -0.1996674 -0.4152661 -0.0515644 0.0385232 -0.0596678 -0.2207436 -0.4445599 0.0743615 0.0756029 -0.0845117 -0.5635571 -0.0977341 0.0381464 -0.1379622 -0.2680486 0.4721172 0.016749 -0.1632857 -0.1952931 0.0761462 -0.0848725 -0.4124518 -0.1120588 0.0491277 0.7563725 0.4962142 0.0352395 0.2865184 0.1699148 -0.0084112 -0.0937889 -0.1296928 0.1123401 -0.3725855 -0.0368607 0.1005504 0.356558 0.2479327 -0.0269631 0.2624272 0.0605481 0.0517005 0.5965831 -0.1679588 -0.1566975 -0.4554013 0.3540596 0.1867924 -0.196888 0.2145561 0.1091975 1.7988431 -0.3145786 0.0474113 -0.6173054 0.4556002 0.3296252 -0.2405665 0.3887093 0.9202545 0.4593625 -0.0292669 -0.1427069 0.0901004 0.328165 0.0951001 -0.1133811 0.1264186 0.0515022 0.9548785 -0.0961974 0.0679548 -0.053591 0.3351134 -0.0495736 0.2914002 -0.0783616 0.2825904 0.4031781 -0.0316429 -0.1319039 0.0845231 0.4719621 0.1655106 -0.1065672 0.1848178 0.0357198 -0.1312472 0.064021 0.0396124 0.0610182 0.0259173 -0.0260967 0.0107603 -0.0252199 0.0335109 -0.0586906 -0.0157868 0.0291206 -0.024206 0.0614498 0.095656 0.0797311 0.0510779 0.0203238 0.106892 -0.0017251 -0.0217827 0.0908155 0.0496157 -0.0337499 0.0257387 -0.008872 0.1239528 0.0549596 -0.0657176 0.0142961 -0.0499806 0.102646 -0.0092679 0.0057301 -0.0175255 0.1501855 0.0120407 0.0635253 0.0526015 0.0612517 0.0551405 -0.0419386 0.0560743 -0.0432518 0.098471 -0.0546853 -0.0155089 0.0655332 -0.0184934 0.0355822 0.0729567 -0.0375826 0.0738993 -0.0699646 -0.0378741 0.0287575 -0.0110843 -0.0359955 -0.1162846 -0.0513147 -0.0764672 -0.0147942 0.0565697 0.0850872 -0.0168545 0.0082736 -0.0238115 -0.0539607 -0.0585241 0.0068529 -0.0595443 0.1135652 -0.1029764 0.0159432 -0.0937472 0.0133514 0.1092085 -0.0178847 -0.1138672 -0.0118158 0.0182943 0.1072357 -0.0052942 0.0282007 -0.012674 0.0324675 0.1041021 0.088158 0.0789382 -0.0738323 0.0979077 -0.0733853 -0.006787 -0.025921 -0.1090778 -0.0487458 0.035955 -0.0503335 0.0875023 unknown
polarizability: 172.7036838|12.5192595|124.7661899|-9.730695|16.7076325|82.6652844 unknown
InChI: InChI=1S/C9H10N4O2/c1-2-15-8(14)4-13-6-12-7-3-10-5-11-9(7)13/h3,5-6H,2,4H2,1H3
charge 0 multiplicity 1
25 atoms
O  -3.274245 0.179441 0.323289
O  -2.00092 -0.928952 -1.290857
N  0.301572 -0.655932 0.392417
N  2.005783 -1.901015 -0.532922
N  1.510375 1.474241 0.744581
N  3.85337 1.354552 0.011734
C  -1.012623 -0.268866 0.894015
C  1.416145 0.185941 0.340267
C  2.470226 -0.601411 -0.233237
C  0.717989 -1.886074 -0.151954
C  -2.11094 -0.387811 -0.17071
C  3.71286 0.050656 -0.381274
C  -4.476985 0.124711 -0.576301
C  2.76189 1.994123 0.546819
C  -5.616897 0.802543 0.173773
H  -1.304621 -0.883926 1.765561
H  -0.94543 0.777963 1.239179
H  0.032659 -2.72351 -0.259356
H  4.592259 -0.444039 -0.805655
H  -4.218537 0.639649 -1.518555
H  -4.684034 -0.936246 -0.804485
H  2.910918 3.034092 0.849196
H  -6.529303 0.789834 -0.449561
H  -5.83638 0.279145 1.119787
H  -5.369236 1.852488 0.404048
