program: Gaussian 09
title: 000234624
version: EM64L-G09RevD.01
frameworkgroup: C1[X(C16H20N4O7S)]
method: RPBEPBE
basis: SDD
operation: Freq
keyword: #p
keyword: freq=noraman
keyword: PBEPBE/SDD
title: #p freq=noraman PBEPBE/SDD
converged: YES YES NO NO
title: Mulliken charges:
elementType: S O O O O O O O N N N N C C C C C C C C C C C C C C C C H H H H H H H H H H H H H H H H H H H H
charge: 1.009427 -0.266367 -0.489230 -0.445101 -0.462469 -0.331471 -0.545215 -0.492135 -0.212574 -0.097982 -0.633870 -0.692973 -0.095395 -0.156468 -0.096419 -0.066315 -0.388104 0.287809 -0.226453 -0.100520 0.328860 -0.060467 -0.262493 -0.178606 0.455315 -0.336298 -0.413749 -0.802240 0.249589 0.250035 0.281942 0.244210 0.234736 0.240119 0.384812 0.367762 0.273683 0.364303 0.361326 0.359415 0.383580 0.291391 0.302038 0.240945 0.242130 0.228193 0.236043 0.235249
chargesum: 0.00000
title: Mulliken charges with hydrogens summed into heavy atoms:
elementType: S O O O O O O O N N N N C C C C C C C C C C C C C C C C
charge: 1.009427 -0.266367 -0.104418 -0.077339 -0.098166 -0.331471 -0.545215 -0.492135 -0.212574 -0.097982 0.086871 -0.309393 0.154194 0.093568 0.185523 0.177895 0.086751 0.287809 0.047231 -0.100520 0.328860 -0.060467 0.028898 0.123432 0.455315 -0.095353 -0.171618 -0.102755
polarizability: 3.55892678e+02 -1.30790992e+01 2.36875838e+02 -1.11657611e+01 -1.70602537e+01 1.92438767e+02
1716.lowfreq: -31.7526 -0.0017 0.0006 0.0012 1.7133 2.8136 9.3728 14.6825 20.0434
frequency: -31.7334 14.6137 19.6641 27.6750 35.9370 41.7001 63.1271 69.5768 72.0767 77.8713 102.3273 120.4944 130.3827 136.1908 149.0074 165.6699 169.1843 189.7144 203.9981 213.2467 228.0223 241.8624 261.2262 268.1022 280.9810 298.5706 301.5408 314.0577 319.8537 346.4735 359.1853 378.6679 390.7194 407.2513 424.9246 440.6090 470.0784 476.9480 498.8252 514.7851 523.1040 555.1399 578.9057 584.3940 605.2221 615.5168 621.6401 628.5834 639.5989 650.0216 696.0278 708.9285 715.5279 730.7653 748.7116 766.9180 775.7856 782.8571 807.7011 820.7994 830.3912 844.6927 876.3640 901.6962 920.2342 942.7375 954.8532 956.3763 959.9536 980.9374 981.3715 986.5445 996.0279 1023.7511 1046.4053 1049.4688 1052.1251 1067.9670 1087.2868 1093.9304 1120.0358 1136.0191 1140.6728 1155.6359 1173.3317 1183.3958 1186.3775 1208.3929 1216.9537 1245.4517 1249.6908 1269.9814 1273.6755 1291.2810 1299.5382 1304.6083 1311.4584 1325.9655 1346.1483 1361.5162 1381.3621 1383.4967 1390.8014 1391.5813 1399.8750 1401.1354 1412.2157 1441.1998 1463.1304 1469.8823 1473.1480 1473.8027 1475.1390 1556.9302 1594.0615 1596.6207 1599.1426 1636.8236 2977.4791 2981.5027 2989.7313 3007.8314 3014.9782 3040.8991 3060.4917 3091.6312 3093.6802 3133.0979 3140.8123 3162.6841 3180.9665 3274.7854 3406.2823 3463.0603 3520.1696 3549.1689 3575.7415 3600.3926
redmass: 1.0236 6.1390 5.6353 6.2870 6.1421 4.3900 5.6215 2.4457 6.5736 6.2292 6.6889 5.8949 9.2610 6.8699 4.3362 2.1255 3.3189 5.5804 4.8607 6.3518 8.4807 5.8912 6.6193 6.6921 5.1583 5.0080 4.5024 4.5412 4.4499 1.6855 2.4623 4.1494 5.8633 2.8466 10.1934 4.3311 4.8189 3.7525 3.3368 4.3762 1.1874 5.5888 2.7873 4.4750 1.6503 2.9986 6.0420 1.4987 3.9698 6.0747 4.0060 3.2522 4.2865 1.9489 1.3572 3.5669 4.9422 4.3746 9.8500 1.6358 4.4767 1.2587 2.6996 2.5704 4.0725 6.9075 1.3814 8.3476 3.9036 1.5344 4.0820 1.8636 3.0754 2.4690 1.9685 1.5817 2.4453 3.2356 2.5209 2.7874 1.2905 2.0813 1.8892 2.2920 2.1774 1.8724 1.1379 1.3548 3.0612 1.2815 1.2899 2.3913 1.4292 1.9076 1.2579 1.3347 1.1909 1.2936 1.2997 1.3049 5.2352 1.5219 1.5417 2.6541 1.4852 3.0288 1.4934 6.7604 4.8625 1.0461 1.0854 2.3379 1.1092 3.2967 5.9066 4.5853 2.9186 2.5081 1.0829 1.0375 1.0851 1.0860 1.0596 1.0884 1.0974 1.0989 1.1079 1.0894 1.0905 1.0956 1.0952 1.0974 1.0448 1.0780 1.0656 1.1047 1.0662 1.0673
irintensity: 0.3573 1.9319 1.0852 0.5408 0.2176 0.0213 9.6132 66.8610 2.5362 1.4902 3.9408 7.3766 1.7160 2.2869 16.2958 31.1472 36.5455 12.7878 23.4056 11.3925 6.5712 6.7680 12.4496 0.2589 16.0282 6.9818 13.7528 7.1637 1.7561 106.0482 35.9060 10.8377 20.7559 0.2901 72.3386 35.1970 31.6309 0.5128 8.4150 95.2590 142.0103 77.6568 69.5711 19.1113 46.0394 50.9735 2.3177 95.1167 5.2149 24.7256 60.4053 26.0098 61.6563 104.9957 134.9787 14.3639 20.4366 79.7805 74.7958 72.9291 45.1435 6.8182 24.3792 5.0949 77.4326 50.2617 2.3890 72.6644 187.5204 18.0793 98.1769 6.0755 7.7234 16.3032 22.8320 13.3853 26.6302 14.2324 130.2981 102.8537 9.0746 35.7889 58.1721 8.6266 118.9418 18.5406 13.4783 27.6070 2.9551 1.5287 5.4110 1.3066 6.3355 203.4495 4.0406 42.8862 28.2928 33.5544 4.4423 11.4138 3.5874 14.8616 18.9617 13.0726 25.9879 151.1047 8.9331 86.9466 135.0401 14.2308 5.4629 29.1548 18.5463 403.2205 12.5528 15.2666 49.3295 307.6564 1.4491 29.3415 27.5653 74.2209 28.1169 20.9455 17.7351 16.8657 36.6777 13.9533 11.7109 6.7155 8.5377 0.9330 74.3682 94.1632 50.6863 260.3331 33.8352 24.1956
temp: 298.150 k
press: 1.00000 atm
elementType: 16 8 8 8 8 8 8 8 7 7 7 7 6 6 6 6 6 6 6 6 6 6 6 6 6 6 6 6 1 1 1 1 1 1 1 1 1 1 1 1 1 1 1 1 1 1 1 1
symmnumber: 1
zpe: 944692.6 jmol-1
zpe.correction: 0.359814 hartree
zpe.thermalcorrener: 0.387508 hartree
zpe.thermalcorrenthalpy: 0.388452 hartree
zpe.thermalcorrgfe: 0.299154 hartree
zpe.sumelectzpe: -1763.052410 hartree
zpe.sumelectthermal: -1763.024717 hartree
zpe.sumelectthermalent: -1763.023772 hartree
zpe.sumelectthermalfe: -1763.113071 hartree
dipole: -8.6157 -5.4949 -4.0616
dipole: 10.9964
quadrupole: -100.2655 -176.7582 -174.6593
quadrupole: -25.7196 -8.8749 -10.6717
quadrupole: 50.2955 -26.1972 -24.0983 -25.7196 -8.8749 -10.6717
hfenergy: -1763.4122248 hartree
pointgroup: C01 [X(C16H20N4O7S1)]
dipole: 3.4342245 -1.7174075 -1.9933984 debye
polarizability: 355.1431323|16.8164695|190.2418054|12.0740429|-11.9482216|239.8223453 unknown
InChI: InChI=1S/C16H20N4O7S/c1-8-2-4-9(5-3-8)28(25,26)19-15(24)11-14(17)20(7-18-11)16-13(23)12(22)10(6-21)27-16/h2-5,7,10,12-13,16,19,21-23H,6,17H2,1H3
charge 0 multiplicity 1
48 atoms
S  -3.377137 0.821702 1.845823
O  4.599816 -1.731611 -0.165369
O  3.746622 1.390562 -1.904725
O  6.528473 1.389144 -0.554683
O  7.149775 -0.049027 2.039508
O  -1.519731 0.859753 -0.730176
O  -3.685023 0.221769 3.327071
O  -3.374762 2.417093 1.580395
N  2.485419 -0.589219 -0.193279
N  0.958169 -0.776714 1.490406
N  1.108601 0.458568 -1.952492
N  -1.723563 0.109886 1.497252
C  4.550422 0.272541 -1.446087
C  5.395441 0.55197 -0.197092
C  3.683165 -0.936061 -0.996002
C  5.771098 -0.880039 0.238093
C  6.045391 -0.993936 1.741181
C  1.293092 -0.036791 -0.685268
C  2.216375 -1.032889 1.132036
C  0.361214 -0.154964 0.371944
C  -1.012061 0.320476 0.317092
C  -4.521982 -0.028547 0.612077
C  -5.263581 -1.123299 1.084611
C  -4.628389 0.490246 -0.685585
C  -6.311892 -1.258139 -1.144382
C  -6.162508 -1.735662 0.186145
C  -5.538748 -0.143249 -1.561894
C  -7.28337 -1.934128 -2.095082
H  5.229108 -0.074228 -2.253894
H  4.766334 1.038361 0.577982
H  3.361879 -1.561482 -1.847703
H  6.653452 -1.21902 -0.340708
H  6.297668 -2.028665 2.038165
H  5.177816 -0.648919 2.327834
H  4.329909 2.18535 -1.996032
H  7.077825 1.492653 0.267235
H  2.962323 -1.550553 1.724043
H  8.009683 -0.53479 2.077604
H  1.903224 0.923531 -2.403875
H  0.152897 0.798255 -2.114585
H  -1.242897 -0.28319 2.319629
H  -5.148797 -1.46417 2.118597
H  -4.011305 1.336824 -0.998261
H  -6.757937 -2.59194 0.524099
H  -5.644466 0.235054 -2.584746
H  -7.322868 -1.419578 -3.069821
H  -6.992994 -2.985449 -2.279907
H  -8.307081 -1.948876 -1.677275
