program: Gaussian 09
title: 000234623
version: EM64L-G09RevD.01
frameworkgroup: C1[X(C9H15N5O5)]
method: RPBEPBE
basis: SDD
operation: Freq
keyword: #p
keyword: freq=noraman
keyword: PBEPBE/SDD
title: #p freq=noraman PBEPBE/SDD
converged: NO YES NO NO
title: Mulliken charges:
elementType: O O O O O N N N N N C C C C C C C C C H H H H H H H H H H H H H H H
charge: -0.252436 -0.442367 -0.471665 -0.498912 -0.340743 -0.177705 -0.098037 -0.642946 -0.384052 -0.508173 -0.164505 -0.150513 -0.168644 -0.034238 -0.397486 0.312927 -0.271116 -0.120409 0.182444 0.265474 0.301199 0.240036 0.252029 0.256656 0.234564 0.349267 0.386828 0.313869 0.376959 0.335048 0.370548 0.347188 0.299154 0.299752
chargesum: 0.00000
title: Mulliken charges with hydrogens summed into heavy atoms:
elementType: O O O O O N N N N N C C C C C C C C C
charge: -0.252436 -0.093099 -0.084836 -0.121952 -0.340743 -0.177705 -0.098037 0.062651 -0.036864 0.090734 0.100969 0.150686 0.071392 0.217791 0.093734 0.312927 0.042753 -0.120409 0.182444
polarizability: 2.02213346e+02 1.07920383e+01 1.29723048e+02 4.72494185e+00 -1.45825455e+01 1.20900295e+02
1716.lowfreq: -9.9528 -6.0059 -2.4508 -0.0008 -0.0005 0.0002 16.1497 30.7155 56.7707
frequency: 15.4993 30.6628 56.7700 73.9081 94.5695 107.5594 127.7793 148.3149 162.7840 171.8033 188.9018 209.5670 237.6456 253.6131 269.4464 280.3602 292.6470 308.5681 326.7654 332.8020 365.7391 385.3106 401.1003 426.9312 434.9386 475.8882 548.9649 568.1817 631.5511 648.7435 663.7092 700.4381 704.0323 714.5776 728.2215 739.7620 761.9006 774.9855 776.1776 801.3649 806.0174 854.4918 865.6580 926.6723 946.3943 951.6721 971.9150 985.8758 1008.5245 1029.1265 1071.0756 1078.4901 1088.7969 1133.7803 1165.4243 1177.0797 1181.5370 1199.3728 1202.8054 1225.1633 1241.4056 1268.6745 1271.8091 1278.4246 1285.4483 1297.3696 1309.2863 1334.2581 1338.1783 1362.8861 1375.4974 1402.6336 1422.1123 1434.8278 1464.8073 1474.0645 1479.2165 1556.1412 1602.6078 1642.0740 1678.9773 2984.2870 3002.2014 3032.0295 3055.0326 3063.5640 3079.0018 3239.0422 3332.9716 3383.9495 3421.6119 3497.4268 3540.5532 3571.8701 3603.4934 3626.2662
redmass: 5.6813 5.2438 6.0008 5.2726 5.6069 5.0370 4.1203 2.3382 2.5979 2.3157 4.4420 4.6457 5.4203 3.4501 1.7544 3.3946 4.0475 3.7004 2.0302 2.0225 2.2463 1.9961 3.0632 3.6917 6.0511 7.0527 5.2900 4.6561 3.7969 1.6511 2.3956 3.2097 1.5657 1.2923 2.7944 4.9981 2.3171 1.9555 1.7868 5.4209 3.3876 7.9260 4.9684 3.4298 3.5942 5.9522 3.1977 2.3629 5.0124 2.9084 2.6922 2.4966 2.2589 2.1152 1.4452 1.2071 2.2252 1.5604 2.0383 1.2655 2.6587 1.2951 1.5686 1.5839 1.1548 1.3106 1.3232 1.3705 1.4731 2.0868 1.3549 1.5566 1.4328 4.8234 2.8932 1.1012 3.7265 2.3846 2.2502 3.7537 1.0639 1.0859 1.0562 1.0865 1.0917 1.0880 1.1052 1.0999 1.0660 1.0426 1.0526 1.0986 1.0794 1.0664 1.0670 1.0963
irintensity: 0.7155 2.0187 6.4593 1.6578 0.8615 1.2125 7.0629 13.5882 18.9095 2.5667 11.4476 32.5264 8.8064 17.8153 115.6819 6.8571 6.2936 36.7176 111.4011 52.9852 27.3083 72.3485 30.6903 49.7703 8.5772 9.8240 3.1102 7.3721 18.3980 104.7617 10.8691 60.7154 141.6507 154.6125 48.8513 8.8118 77.0730 41.7199 84.1186 119.7888 35.4323 38.0262 40.4759 82.6136 2.3114 59.5545 43.4885 20.1073 148.7154 39.4741 27.4409 1.7016 22.1259 10.1516 44.7434 6.7220 24.6070 26.3192 26.5018 15.0258 120.7033 8.8816 31.4847 6.2222 0.2010 3.2035 16.0963 1.7541 4.9892 9.6200 29.3667 9.2448 44.8386 15.1669 7.7623 8.2777 289.0938 308.6284 45.8842 372.2705 23.6732 54.3091 22.1769 18.9288 12.1309 9.6469 48.5683 18.8479 196.6376 0.4026 92.6724 0.5539 49.0577 13.2244 14.4813 63.2292
temp: 298.150 k
press: 1.00000 atm
elementType: 8 8 8 8 8 7 7 7 7 7 6 6 6 6 6 6 6 6 6 1 1 1 1 1 1 1 1 1 1 1 1 1 1 1
symmnumber: 1
zpe: 692436.6 jmol-1
zpe.correction: 0.263735 hartree
zpe.thermalcorrener: 0.282896 hartree
zpe.thermalcorrenthalpy: 0.283840 hartree
zpe.thermalcorrgfe: 0.215396 hartree
zpe.sumelectzpe: -1000.325634 hartree
zpe.sumelectthermal: -1000.306473 hartree
zpe.sumelectthermalent: -1000.305529 hartree
zpe.sumelectthermalfe: -1000.373973 hartree
dipole: -5.7475 1.6309 1.7405
dipole: 6.2228
quadrupole: -110.4048 -105.2435 -109.0424
quadrupole: -4.6704 2.7050 10.9035
quadrupole: -2.1746 2.9867 -0.8122 -4.6704 2.7050 10.9035
hfenergy: -1000.5893692 hartree
pointgroup: C01 [X(C9H15N5O5)]
dipole: 2.3687568 -0.3030888 0.5393562 debye
polarizability: 196.3257702|21.8703436|134.2769483|-11.2294628|12.5299541|122.2339709 unknown
InChI: InChI=1S/C9H15N5O5/c10-7-4(8(18)13-11)12-2-14(7)9-6(17)5(16)3(1-15)19-9/h2-3,5-6,9,13,15-17H,1,10-11H2
charge 0 multiplicity 1
34 atoms
O  1.925309 1.032985 1.123643
O  2.865644 2.793536 -1.154877
O  3.021216 -0.835458 -1.596697
O  3.802734 -2.143875 0.590946
O  -3.875397 0.119499 1.230575
N  0.063409 0.575916 -0.380794
N  -1.355782 -0.959572 -1.284975
N  -1.351469 1.518431 1.404225
N  -4.050141 -1.526147 -0.432002
N  -5.385284 -1.89359 -0.122001
C  2.287351 1.448974 -1.211699
C  1.213336 1.439546 -0.107558
C  3.302676 0.349576 -0.790029
C  3.06109 0.148901 0.746599
C  2.702204 -1.299565 1.124851
C  -1.124959 0.650595 0.362482
C  -0.127954 -0.440047 -1.360554
C  -1.997771 -0.29027 -0.215897
C  -3.358679 -0.536415 0.248698
H  1.885563 1.220496 -2.216052
H  0.850833 2.463023 0.087413
H  4.341329 0.694035 -0.966556
H  3.927255 0.493574 1.335528
H  1.738298 -1.587523 0.66546
H  2.637687 -1.3923 2.223959
H  3.562923 2.877487 -1.85293
H  3.452719 -1.613144 -1.131159
H  0.670208 -0.75384 -2.028103
H  3.746083 -3.05933 0.957909
H  -0.58473 1.864417 1.978636
H  -2.297982 1.439596 1.797577
H  -3.594281 -2.014455 -1.206187
H  -5.445289 -2.23113 0.849684
H  -6.017151 -1.089923 -0.253713
