program: Gaussian 09
title: 000234620
version: EM64L-G09RevD.01
frameworkgroup: C1[X(C4H3ClN2O4S)]
method: RPBEPBE
basis: SDD
operation: Freq
keyword: #p
keyword: freq=noraman
keyword: PBEPBE/SDD
title: #p freq=noraman PBEPBE/SDD
converged: NO YES NO NO
title: Mulliken charges:
elementType: Cl S O O O O N N C C C C H H H
charge: -0.163229 0.910310 -0.472213 -0.413182 -0.176777 -0.209200 -0.400952 -0.348698 -0.157336 0.252480 -0.098199 0.192292 0.327701 0.383662 0.373342
chargesum: 0.00000
title: Mulliken charges with hydrogens summed into heavy atoms:
elementType: Cl S O O O O N N C C C C
charge: -0.163229 0.910310 -0.472213 -0.413182 -0.176777 -0.209200 -0.017290 0.024644 -0.157336 0.252480 0.229502 0.192292
polarizability: 1.49751206e+02 -1.34617658e+01 1.04517283e+02 -1.65172700e+00 -5.73653306e-01 8.05547232e+01
1716.lowfreq: -11.5784 -3.4489 -0.0021 -0.0012 -0.0005 4.5342 41.6047 58.1511 107.9107
frequency: 41.5853 58.1225 107.9102 141.7700 160.2073 173.5324 218.3252 246.1667 251.6590 302.4365 364.1631 396.8296 410.2334 443.8256 508.1798 567.0189 592.9271 656.3565 689.0930 729.7476 741.6984 780.5593 817.7983 927.8202 955.0967 958.0750 1001.8064 1146.1245 1185.5410 1292.4663 1354.0978 1373.3665 1449.0773 1599.2771 1660.0863 1692.7614 3162.6832 3513.7745 3547.1998
redmass: 12.7992 11.4347 11.0089 11.7151 8.3684 16.3580 13.2990 18.8437 15.9873 11.6508 12.6847 9.2364 3.9622 16.2363 8.1322 6.4235 8.5992 1.4501 1.8692 3.7193 8.5556 2.3246 17.6295 3.4106 1.7430 4.4466 6.7861 5.8001 1.9363 2.3810 2.5040 1.5128 2.4208 6.0856 8.2155 5.9201 1.0954 1.0773 1.0793
irintensity: 0.2166 3.0056 2.8134 3.5199 3.2404 1.6333 3.6689 0.3386 7.9790 4.5171 26.7292 28.9611 43.1481 153.9680 9.8840 0.7802 6.3386 75.8967 6.8546 22.8916 7.5014 167.5696 78.0586 5.7772 21.8219 28.0841 8.1881 64.5496 60.6628 143.4124 94.5504 3.7980 56.2750 47.7974 338.8675 689.3552 9.4269 80.2624 138.5895
temp: 298.150 k
press: 1.00000 atm
elementType: 17 16 8 8 8 8 7 7 6 6 6 6 1 1 1
symmnumber: 1
zpe: 216640.1 jmol-1
zpe.correction: 0.082514 hartree
zpe.thermalcorrener: 0.094195 hartree
zpe.thermalcorrenthalpy: 0.095140 hartree
zpe.thermalcorrgfe: 0.043410 hartree
zpe.sumelectzpe: -1421.719025 hartree
zpe.sumelectthermal: -1421.707343 hartree
zpe.sumelectthermalent: -1421.706399 hartree
zpe.sumelectthermalfe: -1421.758128 hartree
dipole: -4.9653 3.5508 0.9575
dipole: 6.1790
quadrupole: -99.8228 -80.9260 -86.6428
quadrupole: -3.5568 2.4115 0.0491
quadrupole: -10.6923 8.2045 2.4878 -3.5568 2.4115 0.0491
hfenergy: -1421.8015384 hartree
pointgroup: C01 [X(C4H3Cl1N2O4S1)]
dipole: -1.9293822 1.4786325 -0.0288766 debye
dipolederiv: -0.3974216 0.0363333 -0.1010701 0.0778467 -0.2410243 0.1396302 -0.287136 0.1592728 -0.6838741 2.0199653 -0.0477598 0.1860668 0.0412424 0.9861163 -0.1918009 0.1835487 -0.1650138 1.5886013 -0.5832584 0.0128456 -0.0262249 -0.0920394 -0.5572764 0.1097229 0.0136664 0.0228227 -0.4367932 -0.5633806 0.0127217 -0.0042804 0.0117417 -0.3441343 -0.0488899 0.0186635 -0.023063 -0.5211299 -0.5042577 0.1346942 0.0127344 0.1838177 -0.9003034 -0.062041 0.0205239 -0.007262 -0.2714174 -1.4385743 0.1063325 0.0269011 -0.038679 -0.4603597 -0.007251 0.0703077 -0.0095184 -0.3580829 -1.1677513 0.3818352 0.0302884 0.2665344 -0.599854 -0.0502456 0.052419 -0.0314777 -0.3473245 -1.5156497 0.2395259 -0.0035759 -0.4887447 -0.4604198 0.0166154 0.0779577 -0.0219137 -0.2788768 -0.6809822 -0.0045394 -0.0077499 0.2985383 -0.7877612 -0.0211043 0.2070038 -0.02839 -0.243362 1.1103946 -0.1725834 -0.0577406 0.1419994 1.3250384 0.0942535 -0.0949126 0.0232236 0.2925976 1.1295798 -0.5213385 -0.0391647 -0.6655117 0.2975768 -0.0088393 -0.1903739 0.0559694 0.0551013 2.1121122 -0.1367586 -0.0577439 0.3483521 1.0917127 0.0358409 -0.109396 0.0200066 0.3444742 0.1425344 -0.0492498 0.0229734 -0.0116041 0.1242244 -0.0046063 -0.0076728 0.002137 0.1572211 0.1496325 0.0505791 0.0086955 0.0675111 0.2357009 0.0018522 0.0157339 -0.002225 0.3428268 0.1870569 -0.0426381 0.0098907 -0.1410048 0.2907636 -0.0031366 0.0296668 0.0054315 0.3600385 unknown
polarizability: 148.7006772|-13.9943411|104.0876472|5.9437212|-5.8613574|82.0348872 unknown
InChI: InChI=1S/C4H3N2O4S.Cl/c7-3-2(11(9)10)1-5-4(8)6-3;/h1,5-6H;
charge 0 multiplicity 1
15 atoms
Cl 2.750898 -0.465722 1.948869
S  2.152674 0.313073 -0.248033
O  2.484002 1.9034 -0.300061
O  2.764867 -0.695622 -1.345384
O  0.20142 -2.252532 -0.11554
O  -3.792486 0.205061 0.15253
N  -1.772608 -0.995263 0.008645
N  -1.758974 1.366116 0.038811
C  0.305687 0.188353 -0.125208
C  -0.346284 -1.126891 -0.083687
C  -0.388506 1.37284 -0.05251
C  -2.544004 0.173838 0.072137
H  0.129584 2.337245 -0.060703
H  -2.296905 -1.877192 0.038756
H  -2.292466 2.238096 0.085377
