program: Gaussian 09
title: 000234572
version: EM64L-G09RevD.01
frameworkgroup: C1[X(C12H15NO)]
method: RPBEPBE
basis: SDD
operation: Freq
keyword: #p
keyword: freq=noraman
keyword: PBEPBE/SDD
title: #p freq=noraman PBEPBE/SDD
converged: YES YES NO NO
title: Mulliken charges:
elementType: O N C C C C C C C C C C C C H H H H H H H H H H H H H H H
charge: -0.259171 -0.210407 0.411479 -0.554315 0.252655 -0.489734 0.140257 -0.664855 -0.586586 0.347298 0.365894 -0.658775 -0.820872 -0.818572 0.232947 0.228443 0.248519 0.239436 0.237825 0.248804 0.228346 0.234496 0.282964 0.225152 0.224927 0.230971 0.226293 0.226251 0.230331
chargesum: 0.00000
title: Mulliken charges with hydrogens summed into heavy atoms:
elementType: O N C C C C C C C C C C C C
charge: -0.259171 -0.210407 0.411479 -0.092925 0.252655 -0.001779 0.140257 -0.427031 -0.337782 0.347298 0.365894 0.087031 -0.139821 -0.135698
polarizability: 2.02471303e+02 -2.12763056e+00 1.42483435e+02 -4.30290021e-01 1.38710521e+00 7.94197674e+01
1716.lowfreq: -16.6556 -4.8197 -0.0006 -0.0005 -0.0004 4.9201 71.4151 80.1420 109.1132
frequency: 71.4092 80.1297 109.1088 133.2671 152.8794 169.2288 217.2029 225.2358 241.3028 282.5541 290.2663 349.3364 368.4522 381.4070 397.3125 448.7039 466.5056 490.7452 551.9303 569.6042 618.2399 628.5726 682.1010 716.5020 748.0343 762.7354 857.4854 869.3305 888.7811 891.8256 972.4127 997.7094 1008.4286 1025.5575 1030.3328 1052.5104 1059.7247 1115.4523 1120.5208 1153.5103 1162.9402 1198.3550 1207.4528 1239.0502 1273.4832 1305.7182 1314.1535 1327.8757 1343.3731 1379.7492 1393.1243 1406.0722 1414.7732 1424.4821 1448.7826 1461.7457 1462.3836 1473.3313 1474.2142 1478.7837 1479.2631 1498.7248 1511.8734 1582.7919 1599.2495 1632.6226 2965.2987 2966.0800 2968.9923 2981.3473 2989.6626 3036.5348 3042.1819 3048.8590 3067.0601 3079.8749 3082.6145 3089.7962 3113.0286 3119.9056 3150.4264
redmass: 5.3349 2.9848 1.0451 1.6613 1.5873 2.5246 2.1879 1.3066 2.5655 2.4937 2.7141 3.5608 3.8543 4.9123 4.3643 3.0850 3.3113 3.8565 2.8324 4.7043 4.2498 4.0228 3.4102 4.5261 3.1543 3.9179 2.3561 1.4603 1.9593 1.5372 2.4438 1.4916 1.5570 1.6493 1.7669 1.6368 2.5142 2.9375 1.3199 1.7046 1.5603 2.0301 1.4035 2.9773 1.4205 1.6742 1.9589 3.7928 2.1938 5.1358 1.2362 1.2662 2.3304 1.3995 1.0850 1.0517 1.0990 1.1042 1.0646 1.1361 1.1772 1.1008 2.7668 7.4195 8.8198 6.9847 1.0626 1.0423 1.0380 1.0366 1.0655 1.0970 1.0969 1.0949 1.0996 1.0984 1.0978 1.0952 1.0909 1.0991 1.0903
irintensity: 1.5648 0.2236 0.0122 9.2091 1.8898 1.8776 0.5588 0.2671 1.0882 0.2462 0.2607 0.2583 2.3608 9.8583 3.1506 4.7805 6.3314 8.6188 1.4155 5.5141 1.0235 2.3701 8.0496 0.7374 2.1740 0.9379 4.3872 20.0688 6.5545 11.2001 5.3227 16.0711 13.8884 9.3448 8.0629 0.2003 29.2345 45.4824 2.4095 30.4237 23.5835 7.3946 25.1290 9.2862 20.5635 6.0403 9.3791 115.5712 5.4216 15.5971 6.6290 8.5690 43.5232 54.8592 11.0966 1.1056 9.2028 25.0456 19.8435 8.2063 90.3648 48.8346 57.4247 30.1198 382.7324 0.8312 43.5680 45.5834 28.8052 41.6909 19.3923 36.9007 7.7089 24.6249 28.8656 37.3064 5.5016 16.7933 21.0806 1.9514 10.6698
temp: 298.150 k
press: 1.00000 atm
elementType: 8 7 6 6 6 6 6 6 6 6 6 6 6 6 1 1 1 1 1 1 1 1 1 1 1 1 1 1 1
symmnumber: 1
zpe: 636367.8 jmol-1
zpe.correction: 0.242380 hartree
zpe.thermalcorrener: 0.255764 hartree
zpe.thermalcorrenthalpy: 0.256708 hartree
zpe.thermalcorrgfe: 0.203215 hartree
zpe.sumelectzpe: -595.251477 hartree
zpe.sumelectthermal: -595.238093 hartree
zpe.sumelectthermalent: -595.237148 hartree
zpe.sumelectthermalfe: -595.290641 hartree
dipole: -4.0668 -0.2941 -0.1441
dipole: 4.0800
quadrupole: -96.7895 -72.7938 -85.0962
quadrupole: -3.1103 -1.1957 -0.3760
quadrupole: -11.8963 12.0994 -0.2031 -3.1103 -1.1957 -0.3760
hfenergy: -595.4938567 hartree
pointgroup: C01 [X(C12H15N1O1)]
dipole: 1.5989146 -0.1236189 0.0691837 debye
polarizability: 202.4902126|1.8414944|142.4636116|0.523733|-1.376037|79.4206807 unknown
InChI: InChI=1S/C12H15NO/c1-8-6-10-4-5-12(14)13(3)11(10)7-9(8)2/h6-7H,4-5H2,1-3H3
charge 0 multiplicity 1
29 atoms
O  -3.907367 0.411741 -0.181879
N  -1.619161 0.822507 0.069369
C  0.001151 -1.040851 0.152495
C  -1.173568 -1.987425 0.316801
C  -0.264178 0.352967 0.040815
C  -2.375688 -1.477685 -0.503783
C  -2.716186 -0.022401 -0.186311
C  1.339908 -1.478633 0.132092
C  0.820298 1.258984 -0.063831
C  2.434467 -0.586126 0.023655
C  2.162129 0.810494 -0.07197
C  -1.89102 2.255688 0.293012
C  3.859138 -1.109915 0.010092
C  3.294765 1.81547 -0.189197
H  -0.898516 -3.01098 0.005598
H  -1.463755 -2.044977 1.386842
H  -3.287372 -2.069287 -0.321215
H  -2.147194 -1.543439 -1.586807
H  1.537833 -2.555429 0.21197
H  0.630427 2.33339 -0.148396
H  -1.566841 2.866747 -0.570298
H  -1.371143 2.607597 1.200996
H  -2.978833 2.369132 0.413917
H  4.389336 -0.830222 -0.92101
H  4.454878 -0.698947 0.848288
H  3.881353 -2.210034 0.090926
H  3.972143 1.769175 0.685482
H  3.918752 1.62186 -1.082948
H  2.911643 2.847296 -0.263306
