program: Gaussian 09
title: 000234566
version: EM64L-G09RevD.01
frameworkgroup: C1[X(C12H16N2O)]
method: RPBEPBE
basis: SDD
operation: Freq
keyword: #p
keyword: freq=noraman
keyword: PBEPBE/SDD
title: #p freq=noraman PBEPBE/SDD
converged: NO YES NO NO
title: Mulliken charges:
elementType: O N N C C C C C C C C C C C C H H H H H H H H H H H H H H H H
charge: -0.293278 -0.058186 -0.219284 -0.105518 -0.259029 -0.519027 -0.441951 -0.398356 -0.387700 0.499464 -0.444792 -0.615510 0.127189 -0.148486 -0.344203 0.218786 0.234553 0.222061 0.238671 0.187215 0.227797 0.231495 0.187350 0.258626 0.253256 0.234240 0.227755 0.189233 0.227550 0.228173 0.241909
chargesum: 0.00000
title: Mulliken charges with hydrogens summed into heavy atoms:
elementType: O N N C C C C C C C C C C C C
charge: -0.293278 -0.058186 -0.219284 0.113267 -0.024476 -0.058295 -0.026939 0.020489 0.124182 0.499464 -0.210552 0.029028 0.127189 0.079687 -0.102294
polarizability: 1.60124957e+02 2.91367678e+00 1.48454570e+02 -1.34264689e+01 6.03093496e+00 1.08252586e+02
1716.lowfreq: -17.7414 -0.0007 -0.0004 0.0003 10.9610 26.9574 63.7848 73.6747 131.5018
frequency: 63.4776 73.4695 131.4805 176.5535 209.0630 233.7606 256.5819 283.0463 328.2974 336.8026 345.0682 379.9979 417.1648 444.9963 479.6559 498.9292 516.1249 559.5915 603.4019 641.7159 701.8823 724.5908 732.9847 779.8452 792.4487 814.4059 853.1512 876.2472 891.8638 914.3768 933.6236 963.7351 976.6151 992.2396 1016.6814 1052.1486 1054.3890 1059.1396 1096.0236 1107.4606 1112.5174 1125.9729 1130.4453 1153.7525 1164.2387 1194.1301 1210.9199 1221.9277 1227.6395 1262.3444 1274.8863 1287.9771 1307.0368 1332.3660 1337.2911 1345.1032 1350.2723 1360.6162 1375.5872 1397.0942 1429.9957 1434.0369 1460.1713 1462.0892 1472.6236 1481.7374 1482.2179 1484.9028 1546.6026 1560.2012 1644.5579 2808.6003 2818.9119 2861.3573 2990.3176 2999.8735 3014.5282 3021.7661 3022.6750 3024.5763 3033.8617 3053.2479 3057.4343 3080.9083 3132.5605 3165.2095 3182.6237
redmass: 3.7361 5.0826 2.6965 2.9261 1.7124 1.8509 3.8628 4.2408 2.5942 2.4327 2.4809 2.6210 2.3775 4.9787 3.3300 3.7438 5.1001 3.8414 5.3249 4.7074 4.1230 2.7555 3.0628 3.4760 2.0600 3.3386 1.4818 2.9141 2.7067 1.6995 1.9789 1.8990 1.3041 2.7167 2.4266 1.9496 1.9995 2.3243 2.0969 1.3741 1.3993 1.4819 1.2724 2.1591 1.4917 2.2417 1.5968 1.3799 1.7159 1.3467 1.6588 2.0669 1.7681 1.3795 1.5451 1.6797 1.5770 1.4693 1.4062 2.1570 1.5476 1.2529 1.0824 1.0615 1.1010 1.0894 1.0902 1.3931 6.4067 7.4437 7.5631 1.0714 1.0694 1.0571 1.0630 1.0666 1.0803 1.0740 1.0844 1.0853 1.0875 1.1034 1.1012 1.1011 1.0884 1.0935 1.0966
irintensity: 0.0347 2.0728 2.9260 3.5142 0.9549 1.2527 1.3849 5.2900 1.9724 2.0290 3.3707 1.9095 1.4235 1.2225 0.9795 0.8758 3.1940 2.1455 1.0156 0.2281 0.1388 11.8672 9.6868 17.2604 59.2520 1.8679 1.8580 2.9232 3.3470 1.5039 1.0841 0.8153 0.5188 8.0283 4.2245 7.2010 10.6242 11.0087 24.7738 3.9175 10.6873 21.6458 7.8487 37.9356 8.7352 3.4985 0.7512 5.9973 12.1901 13.1326 14.4333 1.7309 11.8692 1.9152 2.1283 8.2857 2.8484 13.1874 1.9812 2.8911 12.3158 2.7055 2.9391 28.2637 7.1429 8.4718 7.4289 16.8229 125.0087 162.3596 229.3282 54.7671 155.3693 215.2173 21.8255 8.3645 31.5271 41.3053 75.6027 29.2270 13.2037 27.6698 20.0560 27.2084 19.3126 8.8287 7.6892
temp: 298.150 k
press: 1.00000 atm
elementType: 8 7 7 6 6 6 6 6 6 6 6 6 6 6 6 1 1 1 1 1 1 1 1 1 1 1 1 1 1 1 1
symmnumber: 1
zpe: 689125.2 jmol-1
zpe.correction: 0.262474 hartree
zpe.thermalcorrener: 0.274791 hartree
zpe.thermalcorrenthalpy: 0.275735 hartree
zpe.thermalcorrgfe: 0.224494 hartree
zpe.sumelectzpe: -650.478887 hartree
zpe.sumelectthermal: -650.466570 hartree
zpe.sumelectthermalent: -650.465626 hartree
zpe.sumelectthermalfe: -650.516868 hartree
dipole: 4.6265 -3.0717 -1.9438
dipole: 5.8837
quadrupole: -90.8640 -89.5005 -88.6491
quadrupole: 11.2277 2.1796 -3.2970
quadrupole: -1.1928 0.1707 1.0221 11.2277 2.1796 -3.2970
hfenergy: -650.7413614 hartree
pointgroup: C01 [X(C12H16N2O1)]
dipole: 1.8221194 -1.2458819 -0.697183 debye
polarizability: 160.513225|2.3067966|148.7972004|-12.7733868|4.7259985|107.5216875 unknown
InChI: InChI=1S/C12H16N2O/c1-13-6-9-5-10(8-13)11-3-2-4-12(15)14(11)7-9/h2-4,9-10H,5-8H2,1H3
charge 0 multiplicity 1
31 atoms
O  -2.388752 2.060305 0.64625
N  2.063203 -0.207782 0.933001
N  -0.847089 0.491387 -0.190938
C  1.456014 1.345745 -0.92127
C  0.894398 -1.06134 -1.102132
C  1.3868 0.160212 -1.909438
C  2.46445 1.013357 0.205128
C  1.9149 -1.368166 0.033466
C  0.046234 1.673589 -0.386151
C  -0.491819 -0.804108 -0.530197
C  -1.396683 -1.846968 -0.328633
C  2.901934 -0.489003 2.111015
C  -2.138118 0.837389 0.378573
C  -2.677007 -1.57771 0.243413
C  -3.036123 -0.280426 0.588525
H  1.82584 2.251115 -1.439843
H  0.833028 -1.956616 -1.747376
H  2.387774 -0.044983 -2.33428
H  0.702217 0.381118 -2.749348
H  3.485591 0.908343 -0.253015
H  2.512228 1.850348 0.926892
H  1.568062 -2.233301 0.627957
H  2.889092 -1.655438 -0.44829
H  0.099088 2.199613 0.583473
H  -0.484336 2.359871 -1.072543
H  -1.105993 -2.860941 -0.615916
H  2.896177 0.384765 2.78663
H  3.966943 -0.719621 1.85319
H  2.489316 -1.351065 2.664652
H  -3.381577 -2.401315 0.406499
H  -4.008993 -0.040577 1.025604
