program: Gaussian 09
title: 000234543
version: EM64L-G09RevD.01
frameworkgroup: C1[X(C14H9N3O2)]
method: RPBEPBE
basis: SDD
operation: Freq
keyword: #p
keyword: freq=noraman
keyword: PBEPBE/SDD
title: #p freq=noraman PBEPBE/SDD
converged: YES YES NO NO
title: Mulliken charges:
elementType: O O N N N C C C C C C C C C C C C C C H H H H H H H H H
charge: -0.366617 -0.298589 -0.057479 -0.134098 -0.191406 0.073974 0.060468 0.253479 0.242655 0.286113 0.046497 -0.396583 -0.381194 -0.368086 -0.327971 -0.246141 -0.229245 -0.203916 -0.214908 0.278273 0.301252 0.284772 0.254181 0.229324 0.241698 0.240276 0.226356 0.396914
chargesum: 0.00000
title: Mulliken charges with hydrogens summed into heavy atoms:
elementType: O O N N N C C C C C C C C C C C C C C
charge: 0.030297 -0.298589 -0.057479 -0.134098 -0.191406 0.073974 0.060468 0.253479 0.242655 0.286113 0.046497 -0.118310 -0.079943 -0.083314 -0.073791 -0.016817 0.012454 0.036360 0.011448
polarizability: 3.77738168e+02 7.71847058e+00 1.99711597e+02 4.45021968e-03 1.18340296e-02 6.50181481e+01
1716.lowfreq: -9.6920 -0.0008 -0.0007 0.0002 3.8393 7.7811 57.4331 103.3552 124.9320
frequency: 57.4324 103.3548 124.9319 140.6602 155.5702 180.8880 241.4985 274.4824 291.0162 312.3957 359.1774 362.5911 390.5392 432.7485 442.0581 467.7688 477.3193 481.4538 533.8489 559.3478 569.0431 604.6936 621.1912 653.5718 673.1654 684.6609 692.4522 715.8982 766.8454 768.0380 774.1298 789.3503 859.7222 872.2400 878.5275 896.2295 954.6378 970.1800 978.8588 986.6654 994.4046 1008.3130 1022.0079 1052.4241 1090.2455 1135.0042 1148.9864 1160.5070 1173.2064 1186.4443 1221.5482 1240.6027 1261.5757 1300.9006 1311.9190 1378.4537 1392.3544 1412.3880 1421.7700 1435.2074 1453.5848 1475.5353 1489.6603 1512.3206 1570.5009 1579.7038 1598.6158 1616.9775 1630.6610 3132.2549 3148.3450 3150.7848 3165.1111 3165.5660 3176.8425 3182.4182 3190.8092 3247.8005
redmass: 6.0980 5.2869 6.9359 5.6067 4.9586 5.9203 5.5172 7.2795 6.9587 5.7994 7.8814 6.1490 6.7197 3.2202 2.0346 10.6688 1.5012 7.8835 3.9508 7.4494 3.7441 7.3947 6.3023 6.6802 5.7729 8.0456 7.1284 4.9587 2.7542 1.4029 1.4705 6.2728 7.1087 1.3732 1.4391 8.1631 1.3880 1.3479 7.5468 1.3234 1.3099 2.1439 2.1503 3.7115 2.2201 1.6850 2.7927 1.3484 1.4842 1.8453 3.8871 2.7129 1.7680 1.9297 2.2881 3.7990 4.4366 4.5575 2.6556 2.3097 3.3146 3.6671 3.2913 6.2310 7.5267 5.5776 6.6603 6.5750 8.3968 1.0861 1.0873 1.0906 1.0959 1.0914 1.0984 1.0954 1.0975 1.0659
irintensity: 3.0159 0.2252 0.3762 0.6660 0.4394 0.3582 11.8704 0.1059 1.9897 0.2586 12.0184 1.3125 3.1221 1.2351 14.3480 1.9517 148.5465 10.0300 0.1619 6.2226 0.3346 7.0506 0.0676 2.4807 1.8031 6.1330 8.0033 4.0655 0.4666 131.1227 70.5800 3.4053 23.7142 0.1783 0.2388 2.4080 4.6750 5.8341 47.9837 0.0000 0.1409 3.6292 15.1401 9.8948 24.0682 2.2142 28.4010 13.8108 0.3543 33.4824 42.8350 54.2221 40.2321 73.2863 35.8170 21.6585 6.6483 7.8679 136.6127 9.1407 2.0115 194.9590 11.4381 14.8460 123.6173 138.0977 45.6927 56.5019 41.0014 4.1831 7.8915 17.2622 20.6453 10.2532 19.0366 5.6947 6.1111 55.3251
temp: 298.150 k
press: 1.00000 atm
elementType: 8 8 7 7 7 6 6 6 6 6 6 6 6 6 6 6 6 6 6 1 1 1 1 1 1 1 1 1
symmnumber: 1
zpe: 531949.1 jmol-1
zpe.correction: 0.202609 hartree
zpe.thermalcorrener: 0.216255 hartree
zpe.thermalcorrenthalpy: 0.217199 hartree
zpe.thermalcorrgfe: 0.162759 hartree
zpe.sumelectzpe: -852.219248 hartree
zpe.sumelectthermal: -852.205602 hartree
zpe.sumelectthermalent: -852.204658 hartree
zpe.sumelectthermalfe: -852.259097 hartree
dipole: -2.3994 1.0161 0.0021
dipole: 2.6057
quadrupole: -84.2331 -108.7913 -113.9172
quadrupole: 0.2067 -0.0025 0.0256
quadrupole: 18.0808 -6.4774 -11.6034 0.2067 -0.0025 0.0256
hfenergy: -852.4218565 hartree
pointgroup: C01 [X(C14H9N3O2)]
dipole: -0.9475643 -0.3907851 -0.0185746 debye
polarizability: 377.5834222|-9.337038|199.6285311|0.0456581|5.6506117|65.2559596 unknown
InChI: InChI=1S/C14H9N3O2/c18-16-11-7-3-4-8-12(11)17(19)14-13(16)9-5-1-2-6-10(9)15-14/h1-8,19H
charge 0 multiplicity 1
28 atoms
O  -1.312475 -2.874468 -0.15855
O  -0.303978 2.625372 0.072136
N  -0.527198 1.321113 0.018579
N  -1.092871 -1.464093 -0.098178
N  1.279407 -1.818923 -0.111062
C  0.483982 0.405136 -0.017492
C  0.203289 -1.019216 -0.078105
C  1.921644 0.48951 -0.012156
C  -1.88736 0.823437 -0.004305
C  -2.168392 -0.589222 -0.063504
C  2.371942 -0.892867 -0.071384
C  2.845147 1.560028 0.035131
C  -2.951068 1.75258 0.032442
C  -3.514774 -1.04034 -0.084521
C  3.747756 -1.18682 -0.082465
C  4.221117 1.245506 0.02282
C  -4.278088 1.296666 0.011502
C  -4.554439 -0.099371 -0.046972
C  4.661978 -0.106866 -0.034995
H  2.491714 2.593975 0.078979
H  -2.694016 2.814117 0.07686
H  -3.711633 -2.113662 -0.129878
H  4.091566 -2.224673 -0.126423
H  4.961886 2.05122 0.058162
H  -5.102036 2.015868 0.040197
H  -5.592435 -0.44733 -0.063079
H  5.737715 -0.316731 -0.042706
H  -0.362883 -3.226547 -0.174434
