program: Gaussian 09
title: 000234530
version: EM64L-G09RevD.01
frameworkgroup: C1[X(C11H14N2OS)]
method: RPBEPBE
basis: SDD
operation: Freq
keyword: #p
keyword: freq=noraman
keyword: PBEPBE/SDD
title: #p freq=noraman PBEPBE/SDD
converged: YES YES NO NO
title: Mulliken charges:
elementType: S O N N C C C C C C C C C C C H H H H H H H H H H H H H H
charge: 0.144442 -0.218402 -0.608470 -0.311436 -0.356021 -0.512826 -0.644993 0.117088 0.286703 -0.342977 -0.347308 -0.247166 -0.229636 -0.224047 -0.080979 0.232759 0.232736 0.235754 0.235968 0.274042 0.276153 0.247052 0.278059 0.230912 0.233524 0.233540 0.317072 0.327803 0.220654
chargesum: 0.00000
title: Mulliken charges with hydrogens summed into heavy atoms:
elementType: S O N N C C C C C C C C C C C
charge: 0.144442 -0.218402 0.036405 -0.090782 0.109474 -0.041104 -0.094798 0.117088 0.286703 -0.095926 -0.069249 -0.016254 0.003888 0.009494 -0.080979
polarizability: 2.31587653e+02 7.07783978e+00 1.59410224e+02 1.80469714e-02 -1.34333758e-02 7.15383818e+01
1716.lowfreq: -4.4994 -0.0011 -0.0008 0.0004 3.1528 5.5700 11.7310 22.1046 39.5662
frequency: 10.8107 22.0700 39.5385 42.9366 59.9660 83.8041 120.8635 121.6451 158.0256 160.9049 245.5626 322.0917 328.3174 361.8130 389.2351 397.1594 400.5151 415.5145 459.3323 479.1736 559.7192 568.0866 598.2912 613.3394 643.4420 697.0785 706.4139 732.4852 738.8983 768.5046 792.5818 847.4238 860.4335 944.6483 972.3884 989.7594 991.9948 993.4211 1010.7327 1025.5798 1033.2272 1039.1381 1059.8939 1073.1363 1087.6283 1115.9941 1173.0836 1188.0689 1204.5342 1242.1518 1245.5461 1280.2598 1287.6897 1305.0102 1318.7907 1356.1912 1387.4185 1434.9936 1437.3723 1446.0807 1474.4285 1479.4240 1571.5629 1599.2394 1610.3789 1612.9885 1635.4945 2964.4485 3011.2304 3012.8955 3039.7032 3069.7238 3115.3165 3128.4339 3138.5537 3149.5974 3158.8938 3169.2776 3351.6180 3527.7903 3676.5251
redmass: 5.6453 4.2648 5.5957 5.1158 2.7476 2.7003 3.6443 3.3932 8.5848 3.3910 4.7261 5.2906 1.0359 4.6234 1.2593 4.8287 2.8120 3.2250 6.4949 5.2291 3.3439 2.2806 3.0493 6.4273 6.4665 1.8337 6.9754 1.2527 1.2771 1.5475 5.4872 1.5187 1.2546 1.3934 4.9803 6.1486 1.3766 1.8654 1.3388 2.1841 1.5673 1.5339 3.1595 2.3958 1.7410 1.1531 1.0695 1.1292 1.7627 1.2551 1.5153 2.6528 1.0827 1.7049 1.3745 1.6672 9.4821 1.5435 1.4348 1.0836 1.1112 2.1008 6.7985 6.7833 1.6004 5.8355 2.5418 1.0598 1.0976 1.0606 1.0573 1.1034 1.1079 1.0851 1.0880 1.0923 1.0961 1.1013 1.0766 1.0448 1.1043
irintensity: 1.3971 5.0641 3.9709 2.1289 10.8334 2.5739 0.8545 0.7066 0.1391 0.2053 3.1532 21.7754 17.5908 7.1501 307.0319 0.7491 0.0242 1.1789 2.8729 12.8376 15.4942 5.6399 71.2196 0.3031 8.6560 46.7928 3.0108 1.3584 132.7377 28.7637 1.0612 0.6543 0.3461 2.7052 64.0842 5.9684 0.5384 144.0705 0.5589 3.4102 0.5988 11.8680 0.3937 2.2948 7.1781 1.6226 4.4850 31.6462 66.1790 0.2700 6.8266 362.9843 0.0648 37.5744 23.6573 18.7928 2.5044 11.2158 21.6207 11.0958 9.6918 0.6364 86.5625 46.1690 120.2460 4.0339 238.0632 26.9859 7.3101 6.8821 10.6185 13.8243 20.2084 0.1632 6.1442 17.7325 22.5388 22.1452 26.6299 33.2720 20.8647
temp: 298.150 k
press: 1.00000 atm
elementType: 16 8 7 7 6 6 6 6 6 6 6 6 6 6 6 1 1 1 1 1 1 1 1 1 1 1 1 1 1
symmnumber: 1
zpe: 603445.7 jmol-1
zpe.correction: 0.229840 hartree
zpe.thermalcorrener: 0.245930 hartree
zpe.thermalcorrenthalpy: 0.246875 hartree
zpe.thermalcorrgfe: 0.182116 hartree
zpe.sumelectzpe: -1009.234528 hartree
zpe.sumelectthermal: -1009.218438 hartree
zpe.sumelectthermalent: -1009.217494 hartree
zpe.sumelectthermalfe: -1009.282253 hartree
dipole: -1.0883 2.8753 0.0295
dipole: 3.0745
quadrupole: -49.1575 -98.5361 -101.2888
quadrupole: 3.7891 -0.0222 -0.0104
quadrupole: 33.8367 -15.5420 -18.2947 3.7891 -0.0222 -0.0104
hfenergy: -1009.4643686 hartree
pointgroup: C01 [X(C11H14N2O1S1)]
dipole: 0.4488958 -1.1232284 0.0014033 debye
polarizability: 231.303029|8.3991797|159.6870449|0.113084|0.8292111|71.5461851 unknown
InChI: InChI=1S/C11H14N2OS/c12-11(13)15-8-4-7-10(14)9-5-2-1-3-6-9/h1-3,5-6,12H,4,7-8,13H2
charge 0 multiplicity 1
29 atoms
S  4.161605 0.9363 0.017278
O  -1.12688 2.117945 0.012747
N  6.714191 0.100055 0.004358
N  5.030816 -1.664688 -0.032526
C  1.361434 0.817616 0.010197
C  0.061054 -0.011025 0.005841
C  2.585352 -0.110846 0.011121
C  -1.204634 0.854286 0.006727
C  -2.546447 0.171238 0.000494
C  -2.685853 -1.24324 -0.005333
C  -3.715529 0.980713 0.000616
C  -3.967745 -1.833957 -0.010857
C  -4.99457 0.390951 -0.004993
C  -5.124154 -1.019428 -0.01074
C  5.420031 -0.418604 -0.007356
H  1.375276 1.482484 -0.872608
H  1.370716 1.479554 0.895273
H  0.031045 -0.683444 0.888432
H  0.033659 -0.678608 -0.880417
H  2.630017 -0.758124 0.901736
H  2.635865 -0.75387 -0.882133
H  -1.80077 -1.887838 -0.005546
H  -3.587369 2.068373 0.005174
H  -4.06684 -2.924937 -0.015237
H  -5.889367 1.022952 -0.004935
H  -6.118607 -1.479713 -0.015101
H  7.516015 -0.526761 -0.012854
H  6.88293 1.104231 0.028968
H  5.799462 -2.362512 -0.044027
