program: Gaussian 09
title: 000234521
version: EM64L-G09RevD.01
frameworkgroup: C1[X(C12H19N5O5)]
method: RPBEPBE
basis: SDD
operation: Freq
keyword: #p
keyword: freq=noraman
keyword: PBEPBE/SDD
title: #p freq=noraman PBEPBE/SDD
converged: YES YES NO NO
title: Mulliken charges:
elementType: O O O O O N N N N N C C C C C C C C C C C C H H H H H H H H H H H H H H H H H H H
charge: -0.556419 -0.440207 -0.430909 -0.479398 -0.442507 -0.349468 -0.164725 -0.302185 -0.003949 -0.032898 -0.176656 -0.135061 -0.097228 -0.167985 -0.470937 -0.324940 0.335585 0.009668 0.147524 -0.409397 -0.278797 -0.607729 0.272603 0.234488 0.281518 0.234968 0.235303 0.268414 0.203676 0.208017 0.324014 0.437605 0.343650 0.332250 0.367326 0.263843 0.347336 0.257727 0.250481 0.251480 0.263917
chargesum: 0.00000
title: Mulliken charges with hydrogens summed into heavy atoms:
elementType: O O O O O N N N N N C C C C C C C C C C C C
charge: -0.118814 -0.096557 -0.098659 -0.112072 -0.095171 -0.025453 -0.164725 -0.302185 -0.003949 -0.032898 0.095947 0.099428 0.184290 0.066983 0.032780 0.086753 0.335585 0.009668 0.147524 -0.145554 -0.021070 0.158149
polarizability: 2.61612522e+02 -1.45584777e+01 1.85099034e+02 1.47080888e+01 2.45789854e+00 1.17541917e+02
1716.lowfreq: -4.4154 -3.7151 -0.0007 0.0004 0.0006 9.3450 20.6399 25.0660 36.8003
frequency: 19.9376 25.0046 36.7900 52.5152 92.7273 96.9520 102.2379 107.9171 122.8532 135.4517 170.5616 190.8404 201.8148 226.4648 239.6301 249.6362 273.3400 279.6094 282.0387 301.8219 335.5181 351.9943 358.3080 380.3878 418.1133 426.4971 471.0697 493.3720 498.2840 503.9934 526.0022 533.9505 548.9192 556.5851 629.7201 640.7619 668.7962 683.4248 707.4379 742.7274 758.2725 781.2313 794.0997 825.8628 842.4270 865.1622 874.7055 890.8882 910.1388 930.3193 944.0920 949.4894 962.8306 979.5140 990.9798 1014.4785 1016.7258 1047.7737 1068.8681 1082.4259 1094.2116 1111.3585 1130.1410 1143.3539 1180.8849 1182.6762 1191.2971 1216.0169 1233.2233 1250.8214 1263.7906 1269.5107 1283.2413 1297.6662 1299.5662 1326.7077 1337.5369 1344.8850 1347.8016 1349.2577 1357.4445 1367.8140 1368.3852 1381.0446 1386.9944 1403.0417 1418.9932 1439.0955 1448.4653 1463.5480 1466.6521 1468.7482 1485.7754 1496.8118 1497.9527 1541.2268 1578.1807 1620.2803 2384.5639 2974.7195 2979.5286 2998.6540 3009.7576 3013.8819 3027.1925 3058.1600 3059.1176 3065.9778 3087.8947 3104.7017 3129.8573 3167.5421 3215.6881 3499.8574 3518.4716 3524.0245 3575.7744
redmass: 6.8884 5.7439 5.9140 5.8491 3.3636 4.8588 3.1808 1.3604 4.0806 5.4836 5.0413 4.8178 3.6879 5.9179 4.7220 4.0112 4.0781 4.0312 4.5631 4.6205 2.9690 1.2952 3.4555 3.3838 1.4222 2.9445 4.4419 1.9372 1.7897 1.3426 4.1470 5.3920 4.1373 3.5942 5.2654 5.5114 10.9085 5.1217 4.8274 6.5192 3.6694 3.2935 3.9754 1.7617 1.3878 2.5455 4.8847 3.0055 2.1792 1.4140 3.8308 4.0125 2.8986 2.8345 4.0126 1.2833 3.4016 2.3538 2.9497 2.9864 2.0854 3.9087 1.3136 2.4414 1.6094 1.6701 1.3099 1.9792 1.2738 5.2298 1.3954 1.3167 1.4814 4.0579 1.3026 1.3322 1.2521 1.4308 1.7669 1.3044 1.2945 1.5287 2.6233 1.1524 1.1991 2.2659 1.6297 1.5617 1.5409 1.0895 1.3513 1.0536 1.2207 2.4062 1.7374 3.7329 1.3653 3.8381 1.0942 1.0652 1.0828 1.0758 1.0330 1.0616 1.0803 1.0895 1.0877 1.0938 1.1030 1.1027 1.1021 1.0932 1.0977 1.0644 1.0652 1.0659 1.0779
irintensity: 3.1588 0.7134 1.4360 2.2129 10.7048 0.5226 9.9142 1.8746 4.6772 31.0007 7.3024 2.9616 2.6261 12.0637 4.1406 13.1617 10.7975 3.1849 3.9055 1.6897 10.7621 116.8109 7.4594 24.4631 171.8006 4.7634 46.2624 127.2865 196.7744 85.5637 18.7704 10.1261 3.4784 13.2963 3.8411 40.6720 3.2945 22.3383 1.6624 5.5715 31.1413 26.6601 12.3411 12.2635 17.0131 61.3907 33.2628 43.6359 5.3723 18.5877 42.3121 12.8125 15.2416 31.6468 70.7429 31.7979 91.8059 89.0636 11.5391 22.7661 4.3862 13.7986 1.0464 4.7429 36.6458 6.2761 9.8632 12.5427 27.0357 10.2606 12.2502 12.2075 4.1668 51.3561 15.7351 17.5217 11.1188 0.5698 24.8209 11.2085 48.2715 53.7813 11.4824 26.3871 10.6035 59.8581 7.4127 15.0129 44.3127 14.9701 20.1837 21.0954 102.9570 4.0325 44.2003 60.7053 97.7505 556.4463 3181.2873 36.0628 87.3084 443.7868 37.7129 18.8398 89.3557 22.3644 5.6744 42.1743 8.5841 14.6849 2.4974 6.1990 1.3997 7.0942 7.0716 7.1806 56.3516
temp: 298.150 k
press: 1.00000 atm
elementType: 8 8 8 8 8 7 7 7 7 7 6 6 6 6 6 6 6 6 6 6 6 6 1 1 1 1 1 1 1 1 1 1 1 1 1 1 1 1 1 1 1
symmnumber: 1
zpe: 853260.8 jmol-1
zpe.correction: 0.324990 hartree
zpe.thermalcorrener: 0.346492 hartree
zpe.thermalcorrenthalpy: 0.347437 hartree
zpe.thermalcorrgfe: 0.273376 hartree
zpe.sumelectzpe: -1116.831626 hartree
zpe.sumelectthermal: -1116.810123 hartree
zpe.sumelectthermalent: -1116.809179 hartree
zpe.sumelectthermalfe: -1116.883239 hartree
dipole: 3.9718 2.8939 -1.1233
dipole: 5.0410
quadrupole: -130.7299 -124.5681 -139.4118
quadrupole: -8.4533 -4.1564 -5.8527
quadrupole: 0.8400 7.0019 -7.8419 -8.4533 -4.1564 -5.8527
hfenergy: -1117.1566156 hartree
pointgroup: C01 [X(C12H19N5O5)]
dipole: 1.517886 -0.7739698 1.0150967 debye
polarizability: 261.1822966|-4.2788504|164.1459833|-23.6636083|-29.754396|138.9251934 unknown
InChI: InChI=1S/C12H19N5O5/c1-17-12-6(2-16-17)11(14-5-15-12)13-3-7(19)9(21)10(22)8(20)4-18/h2,5,7-10,13,18-22H,3-4H2,1H3
charge 0 multiplicity 1
41 atoms
O  -1.869246 1.101345 0.456372
O  -2.314903 -0.379795 -1.998568
O  -2.665017 -2.539847 1.043916
O  -3.590403 2.167347 -1.192841
O  -5.24303 1.451086 0.983258
N  0.639545 -1.320174 1.542944
N  4.632906 0.042952 -0.55967
N  0.703559 0.695947 0.309722
N  4.925217 -1.179822 0.056578
N  2.699686 1.547193 -0.815283
C  -2.652157 -0.146014 0.444919
C  -3.340332 -0.288326 -0.941465
C  -1.784998 -1.389656 0.759932
C  -4.30963 0.876377 -1.260589
C  -0.774281 -1.148638 1.929666
C  -5.565278 0.953266 -0.359949
C  1.33863 -0.433573 0.772225
C  2.720033 -0.622102 0.432605
C  3.318759 0.410993 -0.356962
C  3.766325 -1.575345 0.655712
C  1.40387 1.612043 -0.446019
C  5.658869 0.765639 -1.310542
H  -3.435933 -0.029838 1.22227
H  -3.87478 -1.253611 -0.989115
H  -1.235578 -1.692925 -0.147958
H  -4.637779 0.748361 -2.310112
H  -0.983828 -1.894298 2.715094
H  -0.90808 -0.138667 2.357836
H  -6.022275 -0.041973 -0.216785
H  -6.305447 1.621017 -0.845859
H  1.106753 -2.18924 1.800735
H  -0.826505 0.932268 0.399484
H  -1.995499 0.546469 -2.164547
H  -3.350253 -2.258819 1.705775
H  -2.822164 2.030651 -0.532712
H  3.7591 -2.515371 1.205416
H  -4.706222 2.276709 0.839742
H  0.833661 2.484874 -0.777109
H  6.512329 1.003402 -0.654785
H  6.012467 0.154306 -2.157032
H  5.206209 1.695987 -1.686799
