program: Gaussian 09
title: 000234517
version: EM64L-G09RevD.01
frameworkgroup: C1[X(C13H19N5O2)]
method: RPBEPBE
basis: SDD
operation: Freq
keyword: #p
keyword: freq=noraman
keyword: PBEPBE/SDD
title: #p freq=noraman PBEPBE/SDD
converged: YES YES NO NO
title: Mulliken charges:
elementType: O O N N N N N C C C C C C C C C C C C C H H H H H H H H H H H H H H H H H H H
charge: -0.228651 -0.248670 -0.136459 -0.113325 -0.104993 -0.089744 0.007941 -0.378629 -0.353667 -0.459147 -0.459364 -0.356838 -0.356823 -0.452286 -0.451317 0.229403 -0.023921 0.051381 0.157341 -0.758124 0.242931 0.279450 0.250285 0.230916 0.220760 0.234858 0.228159 0.229206 0.254658 0.231134 0.247163 0.229665 0.223938 0.230952 0.223215 0.230066 0.238952 0.257588 0.241996
chargesum: 0.00000
title: Mulliken charges with hydrogens summed into heavy atoms:
elementType: O O N N N N N C C C C C C C C C C C C C
charge: -0.228651 -0.248670 -0.136459 -0.113325 -0.104993 -0.089744 0.007941 0.143752 0.127534 -0.003530 -0.001999 0.128954 0.120005 0.002604 0.001964 0.229403 -0.023921 0.051381 0.157341 -0.019588
polarizability: 2.80480313e+02 -8.80924026e+00 2.14973015e+02 -5.58152987e+00 -7.66528503e+00 1.17928893e+02
1716.lowfreq: -11.7267 -7.6122 -0.0007 -0.0004 0.0004 3.0797 31.4072 47.1372 70.6645
frequency: 31.3713 47.1079 70.6380 75.7233 83.6285 88.4611 110.5184 144.7375 173.0417 193.0745 197.5804 218.6626 229.9030 242.5551 252.4685 268.9952 273.8700 283.4556 315.5703 329.7943 386.5647 444.2500 508.5377 552.1932 567.7408 573.4136 579.2532 624.6560 669.1994 680.2324 708.7543 710.5801 750.6898 771.6198 802.5021 839.8151 856.6682 862.8126 869.0341 885.5434 911.0685 917.1014 919.9186 923.7530 960.4516 969.8425 990.2528 1028.7537 1041.7224 1055.6780 1059.3277 1086.9392 1108.8968 1118.3801 1138.9019 1146.2823 1158.6017 1169.6141 1172.1847 1175.7984 1189.3333 1214.0850 1218.0745 1231.8760 1235.2642 1250.4086 1293.7093 1299.8984 1304.9626 1310.8080 1311.1718 1313.9487 1321.3704 1333.9818 1336.3957 1340.0074 1354.7464 1396.7334 1423.2241 1440.5851 1453.9120 1468.7016 1470.0425 1471.2091 1474.2415 1482.9452 1488.0164 1489.1494 1494.7921 1502.3256 1530.5108 1559.9594 2980.8408 2988.0500 2990.2690 2994.9744 3003.1811 3007.9378 3010.3859 3011.0672 3013.5762 3048.9165 3057.2345 3067.6652 3071.4555 3080.5198 3081.9027 3086.1872 3093.5930 3094.3204 3128.4432
redmass: 4.7887 3.1514 3.0029 4.4056 3.2412 2.8792 5.3192 2.8545 1.0759 5.6604 3.3903 3.8601 5.2592 1.8369 2.0422 5.1063 4.3694 3.7633 4.0449 4.0396 5.1580 5.8325 8.1475 6.0496 1.8896 1.9562 4.1651 5.9444 5.5759 7.2286 5.4732 3.6888 5.8943 8.8797 2.7020 1.7785 2.1137 1.9363 1.9483 4.2073 2.4992 1.3597 2.3907 1.3887 2.0615 1.8894 2.0700 2.9083 1.5896 1.9045 2.2264 2.4778 1.6274 1.7659 2.9896 2.6825 1.6708 1.5447 1.6797 1.8985 2.7664 1.3299 1.3088 1.9661 1.3297 2.1308 2.9729 1.3918 1.5267 1.4589 1.4929 1.6971 2.5277 1.6562 1.6623 1.8524 3.5115 1.2287 6.5757 1.3545 1.0573 1.0889 1.0879 1.1175 1.0941 1.0916 1.1848 1.0856 1.1689 3.1866 5.3134 10.4178 1.0660 1.0677 1.0597 1.0648 1.0373 1.0665 1.0670 1.0606 1.0628 1.1027 1.0965 1.0978 1.0961 1.1006 1.1006 1.0952 1.1053 1.1052 1.1015
irintensity: 0.2014 1.8897 0.3106 0.6859 0.6009 0.1804 1.0081 5.4694 0.5478 3.3105 0.9606 0.5619 6.3564 0.3304 0.8801 1.0358 2.1616 6.7540 1.9189 2.8660 2.5650 1.6420 1.3288 3.4519 4.1032 1.6674 9.7684 4.9866 4.1172 4.1450 3.3050 0.5710 11.0908 17.1635 1.7810 2.4170 13.9200 3.2185 7.8609 3.1923 12.9396 0.4032 11.3905 1.8411 16.4338 10.6470 2.5456 0.9965 5.6210 3.4982 2.0266 5.7340 6.8905 3.9320 62.2443 15.4824 4.6899 34.6402 3.7963 18.7793 97.4334 53.0891 9.7900 112.0142 6.3450 104.0037 124.8388 5.0103 6.7771 5.9468 6.3160 9.7903 34.7870 49.5061 17.7356 26.4653 22.3547 33.4760 71.7164 151.7743 13.8257 9.7279 13.3908 102.3811 41.8555 6.2888 92.6655 15.2319 49.3032 118.8377 1016.3390 449.3617 39.2530 29.1178 27.3707 7.4201 5.3551 31.0570 36.9971 29.9583 30.7432 13.8674 20.4896 16.2785 17.5875 36.2057 28.4923 7.9073 55.7515 53.3949 13.3245
temp: 298.150 k
press: 1.00000 atm
elementType: 8 8 7 7 7 7 7 6 6 6 6 6 6 6 6 6 6 6 6 6 1 1 1 1 1 1 1 1 1 1 1 1 1 1 1 1 1 1 1
symmnumber: 1
zpe: 838256.8 jmol-1
zpe.correction: 0.319275 hartree
zpe.thermalcorrener: 0.337828 hartree
zpe.thermalcorrenthalpy: 0.338772 hartree
zpe.thermalcorrgfe: 0.271988 hartree
zpe.sumelectzpe: -929.410421 hartree
zpe.sumelectthermal: -929.391868 hartree
zpe.sumelectthermalent: -929.390924 hartree
zpe.sumelectthermalfe: -929.457708 hartree
dipole: 4.1406 -5.2590 -1.2518
dipole: 6.8094
quadrupole: -108.9246 -116.1135 -119.5427
quadrupole: 12.7581 5.9941 -0.1983
quadrupole: 5.9357 -1.2533 -4.6824 12.7581 5.9941 -0.1983
hfenergy: -929.729696 hartree
pointgroup: C01 [X(C13H19N5O2)]
dipole: -1.5319884 -2.1961788 0.0836693 debye
polarizability: 279.5235518|11.738473|211.2951349|2.8709403|22.7146901|122.5635335 unknown
InChI: InChI=1S/C13H19N5O2/c1-10-11(18(19)20)12(16-6-2-3-7-16)15-13(14-10)17-8-4-5-9-17/h2-9H2,1H3
charge 0 multiplicity 1
39 atoms
O  2.595455 2.959668 0.826683
O  3.003505 1.623275 -0.982783
N  1.860392 -1.024846 -0.118735
N  -2.735297 -0.30962 -0.18416
N  -0.420712 -0.635438 -0.211922
N  -1.410941 1.506997 0.467429
N  2.259539 1.984747 0.030006
C  3.269858 -0.822936 0.304516
C  1.58041 -2.45447 -0.443232
C  3.776797 -2.258875 0.567104
C  2.983094 -3.100572 -0.4637
C  -3.979999 0.470776 0.032192
C  -2.994035 -1.702703 -0.620423
C  -5.069441 -0.43065 -0.596284
C  -4.516247 -1.866504 -0.393983
C  0.839997 -0.114467 -0.060347
C  -1.481901 0.193093 0.019929
C  1.000316 1.301855 0.22697
C  -0.174625 2.05994 0.556967
C  -0.139718 3.51521 0.963223
H  3.317514 -0.1758 1.199685
H  3.842928 -0.319077 -0.495943
H  1.036423 -2.527703 -1.399637
H  0.930627 -2.894882 0.337349
H  3.525091 -2.576815 1.59595
H  4.86936 -2.335494 0.439791
H  3.437731 -2.99942 -1.466128
H  2.945781 -4.17303 -0.209529
H  -3.897513 1.465065 -0.43637
H  -4.147127 0.629832 1.115425
H  -2.375332 -2.406397 -0.037239
H  -2.718126 -1.827486 -1.686329
H  -5.167248 -0.209996 -1.675299
H  -6.055087 -0.278394 -0.125701
H  -4.710804 -2.206194 0.640006
H  -4.961962 -2.601248 -1.085139
H  -1.176642 3.873569 1.04628
H  0.385629 3.64493 1.924089
H  0.41241 4.132659 0.23239
