program: Gaussian 09
title: 000234506
version: EM64L-G09RevD.01
frameworkgroup: C1[X(C11H15N5O)]
method: RPBEPBE
basis: SDD
operation: Freq
keyword: #p
keyword: freq=noraman
keyword: PBEPBE/SDD
title: #p freq=noraman PBEPBE/SDD
converged: YES YES NO NO
title: Mulliken charges:
elementType: O N N N N N C C C C C C C C C C C H H H H H H H H H H H H H H H
charge: -0.257521 -0.187614 -0.098065 -0.050863 -0.090351 -0.370883 -0.009028 -0.418754 -0.410477 -0.377241 -0.308060 0.135789 -0.211824 -0.113828 0.216255 -0.371118 -0.624035 0.249005 0.217004 0.231042 0.226374 0.204184 0.204514 0.213051 0.187750 0.227572 0.277781 0.240131 0.334321 0.225301 0.284993 0.224596
chargesum: 0.00000
title: Mulliken charges with hydrogens summed into heavy atoms:
elementType: O N N N N N C C C C C C C C C C C
charge: -0.257521 -0.187614 -0.098065 -0.050863 -0.090351 -0.036563 0.239978 0.029292 0.020080 0.040324 0.107261 0.135789 0.065957 -0.113828 0.216255 -0.130987 0.110855
polarizability: 2.32933207e+02 8.86360079e-01 1.47530721e+02 -1.96126700e+00 -2.98863415e+00 9.60802906e+01
1716.lowfreq: -11.6443 -7.9992 0.0005 0.0007 0.0010 4.6412 19.8743 45.7111 62.7389
frequency: 18.9346 45.6727 62.7335 99.9368 115.3125 150.7490 168.5203 200.4106 218.7557 229.6837 249.5146 281.0375 327.5220 365.5738 379.9742 443.7568 452.3462 497.2905 523.1189 561.1137 610.4239 616.2329 643.7733 645.6071 666.2472 717.4981 773.4541 790.3355 798.9687 823.1066 830.4999 848.2085 860.9649 883.1769 925.7695 931.3937 954.2078 993.1268 1012.5885 1043.9442 1071.2218 1083.6289 1090.5184 1121.4005 1122.2124 1146.7263 1165.7625 1166.6137 1190.5269 1212.5017 1249.9584 1252.7687 1281.0997 1300.7529 1313.2390 1318.6048 1333.2177 1338.7443 1344.5391 1361.6263 1364.1349 1374.1459 1389.2515 1413.9365 1429.0021 1447.5132 1450.1789 1456.0816 1460.9227 1470.9083 1474.2231 1489.4165 1506.8820 1545.3145 1623.9751 2946.0740 2963.6580 2974.0111 2976.7560 2990.7269 2995.0461 3047.0379 3048.9563 3054.9934 3064.8077 3084.8147 3115.3996 3160.1986 3248.8326 3552.5102
redmass: 3.8814 3.9656 4.0327 1.3872 2.0735 3.5430 4.6347 4.1344 5.5360 2.3900 4.5193 5.1577 1.9639 3.7500 5.5321 3.8988 3.0508 8.0107 1.7870 3.4694 1.1903 6.6002 5.1729 5.8117 6.5872 5.2188 3.0645 4.9131 2.9330 1.7078 1.7973 6.5110 2.4730 2.5796 1.4294 2.0024 3.4611 2.4179 2.9472 2.2706 2.0471 3.3328 2.2740 2.7483 1.2908 2.7252 1.8820 1.7705 1.4501 1.8187 1.4020 1.3554 2.2279 3.4118 1.6387 3.6295 1.4168 1.4066 1.4387 1.2838 3.3830 1.8171 1.6342 1.3270 2.9600 1.1094 1.6839 1.0990 1.0862 1.4357 1.0948 1.0460 2.5400 6.7670 5.0681 1.0688 1.0846 1.0357 1.0648 1.0608 1.0608 1.0971 1.1021 1.1016 1.1035 1.0969 1.0977 1.0918 1.0985 1.0772
irintensity: 0.4192 4.5754 2.7709 0.5028 1.8209 2.3024 0.4367 1.7966 0.8679 3.2840 1.2088 0.5434 0.0790 9.1701 1.0782 2.6856 3.8366 2.4348 4.4104 8.7388 106.2614 12.6673 28.9424 22.8110 4.3278 0.1324 12.7302 14.2773 10.6609 10.7560 3.7189 7.2158 12.2313 49.4822 11.3886 16.1888 23.5839 39.8448 132.6133 7.3228 36.5901 14.3822 12.5411 2.7253 0.0267 18.8847 3.7567 17.9502 49.0250 117.9798 24.2121 8.6642 40.7232 49.2471 38.5407 30.5957 13.4700 0.9679 6.1165 17.2415 68.1327 9.4244 16.2924 51.6412 83.0361 9.3473 35.2300 19.1850 7.4349 0.2914 14.5715 14.0359 45.9359 59.3995 596.1663 59.3234 5.2491 117.0577 29.9755 34.7574 22.8320 38.0512 38.1565 40.1419 41.8881 35.0693 1.2301 20.5537 0.5506 61.8314
temp: 298.150 k
press: 1.00000 atm
elementType: 8 7 7 7 7 7 6 6 6 6 6 6 6 6 6 6 6 1 1 1 1 1 1 1 1 1 1 1 1 1 1 1
symmnumber: 1
zpe: 683946.1 jmol-1
zpe.correction: 0.260501 hartree
zpe.thermalcorrener: 0.275378 hartree
zpe.thermalcorrenthalpy: 0.276322 hartree
zpe.thermalcorrgfe: 0.217208 hartree
zpe.sumelectzpe: -775.889782 hartree
zpe.sumelectthermal: -775.874905 hartree
zpe.sumelectthermalent: -775.873961 hartree
zpe.sumelectthermalfe: -775.933075 hartree
dipole: 2.6732 -0.8150 1.2800
dipole: 3.0739
quadrupole: -72.9755 -103.7469 -101.8629
quadrupole: 6.7913 0.9641 -1.1491
quadrupole: 19.8862 -10.8851 -9.0011 6.7913 0.9641 -1.1491
hfenergy: -776.1502834 hartree
pointgroup: C01 [X(C11H15N5O1)]
dipole: -1.0490973 0.2021627 0.5666086 debye
polarizability: 232.9293411|1.7836042|144.4535045|0.6459126|12.622905|99.1613732 unknown
InChI: InChI=1S/C11H15N5O/c1-12-10-9-11(14-6-13-10)16(7-15-9)8-4-2-3-5-17-8/h6-8,12H,2-5H2,1H3
charge 0 multiplicity 1
32 atoms
O  -2.675838 0.692284 -0.945653
N  -0.618485 0.316264 0.113736
N  1.09296 1.795961 0.494467
N  0.714118 -1.703837 -0.471738
N  3.134425 -1.259434 -0.378843
N  4.021547 0.875581 0.20794
C  -1.968394 -0.221343 -0.031919
C  -2.717035 -0.343079 1.312516
C  -4.162559 -0.838859 1.065622
C  -4.880854 0.079526 0.048259
C  -4.041178 0.200685 -1.236428
C  0.568085 -0.395076 -0.109306
C  -0.242254 1.622136 0.467994
C  1.609549 0.534746 0.138826
C  2.947145 0.053603 -0.010408
C  2.032839 -2.045469 -0.585165
C  5.4187 0.455978 0.07222
H  -1.858539 -1.223473 -0.500287
H  -2.735464 0.648996 1.803538
H  -2.164383 -1.037896 1.971507
H  -4.718977 -0.876982 2.019581
H  -4.132883 -1.875133 0.670083
H  -5.882138 -0.319954 -0.203384
H  -5.022506 1.08645 0.485788
H  -3.971532 -0.785746 -1.746351
H  -4.456686 0.939073 -1.940999
H  -0.977462 2.399228 0.657612
H  2.238538 -3.079631 -0.877888
H  3.801364 1.837337 0.474301
H  5.940332 1.049258 -0.702232
H  5.422919 -0.603849 -0.224895
H  5.962949 0.564057 1.029306
