program: Gaussian 09
title: 000234505
version: EM64L-G09RevD.01
frameworkgroup: C1[X(C12H15N5O)]
method: RPBEPBE
basis: SDD
operation: Freq
keyword: #p
keyword: freq=noraman
keyword: PBEPBE/SDD
title: #p freq=noraman PBEPBE/SDD
converged: YES YES NO NO
title: Mulliken charges:
elementType: O N N N N N C C C C C C C C C C C C H H H H H H H H H H H H H H H
charge: -0.261312 -0.093296 -0.189436 -0.070508 -0.037176 -0.038647 -0.003054 -0.396951 -0.398793 -0.416829 -0.411022 -0.377423 0.106043 -0.307734 -0.107984 0.125500 -0.211847 -0.379418 0.248711 0.242906 0.247946 0.244974 0.246043 0.217013 0.231402 0.227092 0.204618 0.205291 0.213486 0.188071 0.228403 0.281077 0.242853
chargesum: 0.00000
title: Mulliken charges with hydrogens summed into heavy atoms:
elementType: O N N N N N C C C C C C C C C C C C
charge: -0.261312 -0.093296 -0.189436 -0.070508 -0.037176 -0.038647 0.245657 0.093901 0.092224 0.031587 0.020688 0.041353 0.106043 0.108741 -0.107984 0.125500 0.069230 -0.136565
polarizability: 2.46172169e+02 6.74578312e-01 1.61133374e+02 -1.79943429e+00 -4.89723705e-01 1.01527964e+02
1716.lowfreq: -14.2170 -7.8100 -0.0010 -0.0008 -0.0007 5.6228 9.2671 37.8698 58.5576
frequency: 8.6676 37.6860 58.5522 79.7907 106.4630 141.0190 172.8625 192.1468 218.6871 230.0028 249.4304 290.8865 324.6859 366.9926 382.9041 432.0074 443.4546 455.3400 523.0636 564.1464 588.9677 618.1866 641.5116 659.7039 662.8476 766.3269 785.6232 791.0135 799.7425 807.3638 831.2195 832.7875 860.7669 864.3147 888.8744 922.9724 925.7754 930.9064 972.8364 993.7105 1013.1198 1016.9255 1043.5066 1090.4606 1092.2885 1102.6953 1104.6012 1110.6789 1120.2346 1137.8847 1143.3985 1163.1900 1190.3221 1192.4952 1210.1513 1248.7522 1254.0640 1283.0092 1296.9199 1308.0589 1316.5052 1332.0239 1338.5256 1344.4543 1360.6414 1363.8171 1385.3748 1392.9024 1430.7518 1448.8024 1457.0481 1460.7047 1463.5553 1469.6600 1474.9527 1488.5340 1533.6900 1575.7973 2946.4806 2964.7432 2978.2885 2991.0052 2994.5884 3047.5755 3055.1266 3064.5965 3079.9094 3086.1548 3087.5733 3163.0529 3183.4803 3199.2639 3249.2020
redmass: 3.9146 4.3227 4.0875 3.2326 5.2967 2.8434 4.2487 4.0272 4.9413 2.4151 5.0277 5.5080 1.9889 4.5271 4.8979 6.2948 3.8310 3.2917 1.7895 3.9516 6.1214 7.4623 5.3657 6.8564 7.3477 3.3877 1.0418 4.9338 3.1632 5.5577 1.7463 1.6331 2.5312 4.5279 2.6482 5.3840 1.4906 1.9895 2.3157 1.1730 3.0475 2.4013 2.2509 1.9748 1.5456 1.5746 1.8926 2.6358 1.6167 2.1125 2.0822 1.4262 1.4540 3.5774 1.8892 1.3069 1.3723 2.3483 4.1083 2.3702 2.2056 1.4616 1.4121 1.4356 1.2841 3.6716 1.4101 2.0660 4.1801 1.0963 1.0972 1.0863 1.0788 1.8468 1.0911 2.2861 9.8799 10.8624 1.0689 1.0842 1.0644 1.0609 1.0609 1.0972 1.1015 1.1035 1.0485 1.0967 1.0604 1.0919 1.1187 1.1175 1.0985
irintensity: 0.3965 3.3243 3.3423 1.1958 7.5084 0.5189 2.0923 10.9547 1.1919 4.5418 0.8744 12.5046 1.7659 1.7648 2.6245 8.5735 0.3988 2.7568 4.3408 3.0615 8.6655 4.2557 22.8451 2.3247 12.3111 19.2141 26.9650 14.2829 3.8907 7.4445 9.8805 5.4174 9.4138 20.7638 30.4518 7.1337 12.7736 14.2866 63.0287 1.0709 84.3167 78.1835 5.0168 13.2097 9.7295 1.8117 18.1023 8.1882 22.4056 6.3043 4.6685 9.3218 54.0427 5.9648 110.5005 11.8851 8.8031 46.7835 52.2880 47.8028 4.3940 9.5709 0.1453 4.5166 16.7808 64.1945 7.7689 8.3115 207.5481 3.6772 13.3046 6.2246 2.8859 22.9879 15.6865 29.3913 73.9617 677.6882 59.3327 7.2064 30.1859 35.0610 23.5636 37.8200 37.7375 43.0667 18.4221 34.9602 44.8118 19.5795 0.8838 27.2953 0.6886
temp: 298.150 k
press: 1.00000 atm
elementType: 8 7 7 7 7 7 6 6 6 6 6 6 6 6 6 6 6 6 1 1 1 1 1 1 1 1 1 1 1 1 1 1 1
symmnumber: 1
zpe: 695483.6 jmol-1
zpe.correction: 0.264896 hartree
zpe.thermalcorrener: 0.280100 hartree
zpe.thermalcorrenthalpy: 0.281045 hartree
zpe.thermalcorrgfe: 0.220100 hartree
zpe.sumelectzpe: -813.875485 hartree
zpe.sumelectthermal: -813.860280 hartree
zpe.sumelectthermalent: -813.859336 hartree
zpe.sumelectthermalfe: -813.920281 hartree
dipole: 3.2544 -0.8390 2.7411
dipole: 4.3369
quadrupole: -78.7983 -109.5581 -106.4598
quadrupole: 5.2486 -3.9357 -1.6652
quadrupole: 19.4737 -11.2860 -8.1877 5.2486 -3.9357 -1.6652
hfenergy: -814.1403807 hartree
pointgroup: C01 [X(C12H15N5O1)]
dipole: -1.2369603 -0.1106546 1.1700637 debye
polarizability: 246.1251091|0.48063|151.8073327|-3.182924|21.6528086|110.9010652 unknown
InChI: InChI=1S/C12H15N5O/c1-2-6-18-9(3-1)17-8-15-10-11(16-4-5-16)13-7-14-12(10)17/h7-9H,1-6H2
charge 0 multiplicity 1
33 atoms
O  -2.94301 0.921924 -0.727483
N  3.859772 0.467928 -0.378149
N  -0.824773 0.223968 -0.018537
N  1.015377 1.52855 0.413498
N  2.743593 -1.526668 -1.011478
N  0.297972 -1.777781 -0.95935
C  -2.219354 -0.203366 -0.115396
C  5.157935 0.020423 0.161784
C  4.389219 1.197386 0.793359
C  -2.832308 -0.574666 1.251784
C  -4.328597 -0.929218 1.075539
C  -5.075798 0.225271 0.366696
C  2.687297 -0.25505 -0.488183
C  -4.365944 0.581335 -0.952546
C  1.416444 0.29924 -0.151177
C  0.284404 -0.523284 -0.428139
C  -0.325992 1.440734 0.474294
C  1.572183 -2.201494 -1.219989
H  -2.233756 -1.086169 -0.79088
H  6.031196 0.220073 -0.466807
H  5.173825 -0.936292 0.696944
H  3.895292 1.032825 1.758095
H  4.716583 2.224499 0.607089
H  -2.724347 0.287833 1.93752
H  -2.269199 -1.423589 1.68138
H  -4.785607 -1.145623 2.058044
H  -4.418298 -1.854379 0.469613
H  -6.124792 -0.056954 0.153695
H  -5.095899 1.117889 1.021089
H  -4.426482 -0.270505 -1.665651
H  -4.792277 1.478402 -1.429594
H  -0.987428 2.227067 0.827426
H  1.670374 -3.205809 -1.642887
