program: Gaussian 09
title: 000234501
version: EM64L-G09RevD.01
frameworkgroup: C1[X(C12H11N5)]
method: RPBEPBE
basis: SDD
operation: Freq
keyword: #pfreq=noraman
keyword: PBEPBE/SDD
title: #p freq=noraman PBEPBE/SDD
converged: YES YES NO NO
title: Mulliken charges:
elementType: N N N N N C C C C C C C C C C C C H H H H H H H H H H H
charge: -0.259002 -0.072170 -0.058140 -0.360163 -0.060049 0.127716 -0.111173 0.443059 -0.240716 0.183648 -0.357787 -0.343888 -0.228048 -0.227565 -0.378966 -0.242487 -0.601349 0.264276 0.231589 0.306863 0.337323 0.243127 0.229574 0.231364 0.232482 0.250702 0.250078 0.209702
chargesum: 0.00000
title: Mulliken charges with hydrogens summed into heavy atoms:
elementType: N N N N N C C C C C C C C C C C C
charge: -0.259002 -0.072170 -0.058140 -0.022840 -0.060049 0.127716 -0.111173 0.443059 0.023560 0.183648 -0.126198 -0.037025 0.001526 0.003798 -0.135838 -0.010005 0.109133
polarizability: 2.75005389e+02 -1.00963613e+00 1.64494419e+02 -1.69669684e+00 -3.52094512e+00 7.07904074e+01
1716.lowfreq: -7.1805 -0.0006 0.0004 0.0009 3.1347 7.3932 19.3221 28.6875 45.9292
frequency: 19.1645 28.6431 45.9141 99.3649 118.8412 167.1617 181.1688 212.9221 266.2789 285.2430 303.6666 337.9301 402.0265 406.7684 499.2513 504.4683 544.1722 566.0548 595.0803 615.5051 639.3968 650.3804 666.1450 694.4529 697.6827 722.4139 767.0921 785.6862 811.2748 841.0436 850.4201 918.9463 924.2968 929.0059 974.5022 987.7331 998.0735 1000.9061 1034.7684 1078.2169 1084.4706 1113.6928 1123.5024 1157.3366 1176.1769 1179.5876 1198.5286 1247.3829 1267.7568 1308.0201 1317.3140 1337.3400 1361.6149 1372.0658 1386.1942 1421.1932 1428.6593 1444.1682 1455.7407 1456.1228 1479.5839 1494.5818 1504.2454 1535.8888 1596.6932 1613.6422 1623.3374 2989.8651 3069.3531 3109.8305 3132.0964 3141.8462 3155.1324 3160.4068 3167.8812 3177.9655 3249.5765 3569.0349
redmass: 1.0329 3.9963 4.6433 4.5143 4.2087 3.9731 4.5955 6.7302 5.4075 5.0085 4.9333 5.7773 3.6770 3.8341 6.1011 3.7256 1.2343 2.9588 7.2720 6.5827 4.4571 5.8112 7.6831 2.4577 4.5872 5.5068 1.6941 3.1354 2.2266 1.2653 7.6224 1.4234 7.4752 1.4383 1.3823 4.5039 1.4141 6.4206 2.0622 2.0637 1.7316 4.4709 1.2835 3.8272 1.1537 1.9676 1.1465 1.9062 3.6412 6.8500 4.3709 1.3720 4.2092 1.8914 5.1223 1.7809 2.4022 1.7755 1.9268 1.0545 1.7760 2.1888 1.7901 5.9130 6.6625 5.9920 6.1014 1.0341 1.1012 1.1013 1.0851 1.0892 1.0940 1.0918 1.0982 1.0984 1.0975 1.0779
irintensity: 0.1288 0.6133 2.7019 2.5362 2.8959 1.2739 1.0621 1.2370 0.1579 0.0701 1.0905 1.6300 2.1144 5.7408 3.5927 6.5721 112.8769 3.8805 4.4089 1.3950 13.0691 17.7325 9.9960 36.0603 19.4390 3.8076 76.3095 24.8247 3.6855 1.0059 3.7599 7.7841 32.2122 11.7889 1.4334 0.3484 1.5617 2.4466 5.7257 3.6267 6.9678 12.0561 1.6365 67.6896 1.1586 6.5196 2.0514 39.5090 57.6716 122.2736 68.8787 1.4664 120.1024 7.4164 9.2722 89.5673 20.5337 14.6565 9.5686 13.8513 0.4802 209.7617 18.5836 44.7060 8.4732 295.6420 426.7710 78.0465 28.1489 23.5171 1.3068 12.6396 27.7915 17.1876 8.2253 22.5661 0.1878 73.2623
temp: 298.150 k
press: 1.00000 atm
elementType: 7 7 7 7 7 6 6 6 6 6 6 6 6 6 6 6 6 1 1 1 1 1 1 1 1 1 1 1
symmnumber: 1
zpe: 566909.7 jmol-1
zpe.correction: 0.215924 hartree
zpe.thermalcorrener: 0.229760 hartree
zpe.thermalcorrenthalpy: 0.230704 hartree
zpe.thermalcorrgfe: 0.173036 hartree
zpe.sumelectzpe: -736.460029 hartree
zpe.sumelectthermal: -736.446193 hartree
zpe.sumelectthermalent: -736.445249 hartree
zpe.sumelectthermalfe: -736.502918 hartree
dipole: -0.5425 -1.9017 -0.1748
dipole: 1.9853
quadrupole: -74.1225 -95.4432 -103.0267
quadrupole: -2.9639 -0.7635 -2.3630
quadrupole: 16.7416 -4.5791 -12.1626 -2.9639 -0.7635 -2.3630
hfenergy: -736.6759535 hartree
pointgroup: C01 [X(C12H11N5)]
dipole: -0.2122369 0.7507948 0.036315 debye
polarizability: 274.9980374|0.909343|164.0223573|2.2092421|-7.4897603|71.2698203 unknown
InChI: InChI=1S/C12H11N5/c1-13-11-10-12(15-7-14-11)17(8-16-10)9-5-3-2-4-6-9/h2-8,13H,1H3
charge 0 multiplicity 1
28 atoms
N  -0.623799 0.597838 0.044989
N  1.244377 1.948541 0.115614
N  0.542776 -1.627296 -0.057405
N  4.061962 0.729847 0.030029
N  2.994696 -1.388618 -0.068052
C  0.497649 -0.261706 0.005779
C  1.626669 0.597569 0.040873
C  -2.01733 0.244399 0.014351
C  -0.097288 1.907227 0.116329
C  2.916523 -0.015839 0.001018
C  -2.981564 1.214414 -0.360418
C  -2.426536 -1.068069 0.359251
C  -4.351075 0.877822 -0.360673
C  -3.799436 -1.392489 0.344023
C  1.824896 -2.098032 -0.092799
C  -4.76905 -0.42547 -0.006464
C  5.403071 0.136778 -0.008941
H  -0.735602 2.781981 0.201395
H  -2.675152 2.217759 -0.672792
H  -1.671696 -1.818221 0.606792
H  3.946519 1.742857 0.082396
H  1.933237 -3.185668 -0.146071
H  -5.089687 1.632848 -0.650972
H  -4.109513 -2.409001 0.609414
H  -5.833033 -0.684492 -0.012401
H  5.545897 -0.458917 -0.928026
H  5.563449 -0.538111 0.850706
H  6.151037 0.945752 0.019851
