program: Gaussian 09
title: 000234499
version: EM64L-G09RevD.01
frameworkgroup: C1[X(C16H18N4OS2)]
method: RPBEPBE
basis: SDD
operation: Freq
keyword: #p
keyword: freq=noraman
keyword: PBEPBE/SDD
title: #p freq=noraman PBEPBE/SDD
converged: YES YES NO NO
title: Mulliken charges:
elementType: S S O N N N N C C C C C C C C C C C C C C C C H H H H H H H H H H H H H H H H H H
charge: 0.235391 0.257000 -0.229997 -0.271303 -0.420349 0.012726 0.008505 0.279579 0.123306 -0.362658 -0.229489 0.399123 -0.417867 -0.628041 -0.333282 -0.022401 -0.347473 -0.395613 -0.684650 -0.202175 -0.205537 -0.233201 -0.801400 0.209307 0.208442 0.276353 0.297295 0.196574 0.213425 0.349143 0.272416 0.271828 0.210463 0.218222 0.207245 0.239208 0.240702 0.240343 0.288942 0.290602 0.239296
chargesum: 0.00000
title: Mulliken charges with hydrogens summed into heavy atoms:
elementType: S S O N N N N C C C C C C C C C C C C C C C C
charge: 0.235391 0.257000 -0.229997 -0.271303 -0.071206 0.012726 0.008505 0.279579 0.123306 0.055092 -0.229489 0.399123 -0.417867 -0.054393 0.076717 -0.022401 -0.075057 -0.123785 -0.048719 0.037033 0.035165 0.007142 0.017440
polarizability: 3.76749449e+02 -1.41643226e+00 2.68595139e+02 9.15797816e-01 -1.21442094e+01 1.39092762e+02
1716.lowfreq: -9.3330 -2.8245 -2.2619 -0.0019 0.0013 0.0017 6.5268 24.9022 37.4423
frequency: 1.2834 24.4116 37.3792 39.4312 43.3223 52.0012 62.6038 77.2665 92.3462 105.7898 124.2863 132.3868 141.7500 173.6089 179.3998 212.8540 221.2979 227.3738 234.8730 240.0437 268.6145 312.5617 337.9075 382.1211 397.0029 407.7335 408.8168 465.6186 484.2627 495.1042 537.6509 574.7926 609.3511 610.1718 620.7985 630.4670 648.2618 655.1298 675.9085 700.5096 706.3087 722.9206 738.2911 749.5997 774.1025 800.9629 807.3450 850.5652 863.2663 872.6801 917.9266 925.8871 943.2283 980.1096 982.9485 987.7385 990.2672 1002.4893 1003.6130 1016.7466 1028.6298 1046.2859 1064.9216 1069.8604 1082.7556 1112.1470 1163.4770 1176.7146 1180.3137 1187.1923 1188.2681 1225.8795 1251.7243 1278.1108 1290.5246 1304.6491 1316.8792 1327.4236 1344.2481 1355.4465 1365.1836 1381.6291 1389.2975 1411.7292 1433.3135 1436.2378 1443.8053 1445.7811 1453.8281 1456.3619 1472.1970 1477.7849 1484.4488 1489.2516 1532.7846 1586.0418 1599.5875 1609.3803 1633.9656 2966.9347 2972.9539 2978.1191 3010.3512 3029.1640 3034.9574 3047.0545 3069.9125 3074.3251 3119.2019 3136.5725 3143.0475 3153.9873 3158.0235 3163.5848 3163.9361 3176.1225 3523.2783
redmass: 3.7075 3.4789 3.1221 3.6653 3.9074 3.8537 4.2978 4.0015 5.1036 3.8553 1.4379 4.5769 3.2972 8.4082 4.6069 6.1656 1.4247 4.4705 2.6834 2.2492 3.1036 9.4462 10.1610 8.0619 8.9996 3.5471 4.9847 4.9570 3.9701 5.0042 8.7705 8.5671 6.5695 4.0928 1.4786 5.4561 9.3053 7.6791 5.8682 4.0987 2.6191 4.7051 1.1837 11.7662 1.8082 1.7075 9.1993 1.2399 2.7574 2.0182 1.3627 1.5087 5.3183 1.3840 6.0328 1.2402 4.8444 1.3323 1.3224 2.6567 2.0220 9.4518 1.8331 1.3552 1.5787 2.1085 5.7410 1.0579 3.9498 1.3281 1.4644 1.3434 2.5774 1.2114 1.1997 1.2444 1.4324 2.7376 1.2360 1.6322 4.0172 9.0407 1.2130 7.0113 1.0518 1.0940 2.3326 4.4640 1.0892 1.0746 1.0616 1.0422 1.0751 2.7990 7.1996 8.8018 7.6783 6.1296 8.1094 1.0590 1.0370 1.0607 1.0972 1.0276 1.0948 1.0664 1.1010 1.0992 1.1076 1.0863 1.0887 1.0928 1.1050 1.1059 1.0972 1.1017 1.0784
irintensity: 0.0939 2.0740 0.4395 0.0203 0.8818 0.8978 0.7227 0.9053 5.1092 3.0293 1.7911 2.6974 0.7164 0.6727 3.0239 2.3282 0.2574 1.5069 0.9535 1.1559 0.7917 4.6574 0.8866 2.7592 2.6833 1.4101 0.7736 3.4804 9.2404 14.8449 0.9272 5.0928 1.6854 3.2320 46.1222 23.4257 4.9261 6.4147 3.1032 18.5045 41.3126 30.6473 13.3434 4.2876 42.2081 0.9956 10.0313 1.2489 73.3934 14.8585 10.7052 8.2318 55.9205 1.7560 49.4734 4.9989 1.1097 0.1608 0.9669 6.8112 31.5418 113.5418 9.9377 3.1025 11.3070 0.4516 74.8169 0.6597 103.5102 18.5682 1.5025 1.2821 30.6542 19.2129 25.4491 12.0909 8.7732 22.2476 18.2849 9.0679 75.9217 10.0928 11.4824 54.6302 14.7306 18.8265 5.8162 44.2075 35.9908 6.2655 5.1580 12.6251 15.3386 93.4874 553.9656 37.3476 14.8741 20.2996 790.3971 8.2181 55.7702 57.7978 3.4439 18.5283 12.0054 12.6477 78.8783 47.3702 11.2473 2.8691 1.8086 16.4602 6.5124 9.7335 10.6538 12.3604 49.2027
temp: 298.150 k
press: 1.00000 atm
elementType: 16 16 8 7 7 7 7 6 6 6 6 6 6 6 6 6 6 6 6 6 6 6 6 1 1 1 1 1 1 1 1 1 1 1 1 1 1 1 1 1 1
symmnumber: 1
zpe: 827236.1 jmol-1
zpe.correction: 0.315078 hartree
zpe.thermalcorrener: 0.338403 hartree
zpe.thermalcorrenthalpy: 0.339347 hartree
zpe.thermalcorrgfe: 0.256208 hartree
zpe.sumelectzpe: -1709.191985 hartree
zpe.sumelectthermal: -1709.168660 hartree
zpe.sumelectthermalent: -1709.167715 hartree
zpe.sumelectthermalfe: -1709.250854 hartree
dipole: 5.1010 3.7511 0.3280
dipole: 6.3403
quadrupole: -114.8390 -163.3180 -147.4749
quadrupole: -9.6982 -0.9431 -4.8979
quadrupole: 27.0383 -21.4407 -5.5976 -9.6982 -0.9431 -4.8979
hfenergy: -1709.5070626 hartree
pointgroup: C01 [X(C16H18N4O1S2)]
dipole: -1.965009 1.5238363 0.1973557 debye
polarizability: 376.6761707|-0.7235356|259.8966058|-4.2763687|34.6280868|147.8645726 unknown
InChI: InChI=1S/C16H18N4OS2/c1-3-4-10-23-14-12-13(18-15(21)19-14)20(16(17-12)22-2)11-8-6-5-7-9-11/h5-9,18H,3-4,10H2,1-2H3
charge 0 multiplicity 1
41 atoms
S  3.263733 0.5705 0.069791
S  -2.194129 3.209309 0.419867
O  0.599138 -3.710938 -0.70414
N  -1.765574 0.453161 -0.033928
N  -0.659715 -1.770733 -0.407786
N  0.158861 1.691052 0.218284
N  1.77359 -1.688723 -0.348467
C  -0.688606 -0.420151 -0.186087
C  0.485619 0.340416 -0.027015
C  5.943183 -0.303418 0.157318
C  -1.175306 1.735388 0.212456
C  -3.162709 0.111795 -0.127445
C  1.728882 -0.365701 -0.122312
C  4.529966 -0.842685 -0.112067
C  6.450645 0.721822 -0.883914
C  0.619446 -2.468187 -0.497915
C  -4.039298 0.425179 0.937932
C  -3.638506 -0.55095 -1.285373
C  7.897026 1.180316 -0.600464
C  -5.404011 0.079567 0.834547
C  -5.001824 -0.908851 -1.369195
C  -5.886993 -0.592094 -0.312732
C  -0.787877 4.456883 0.562811
H  5.992168 0.138117 1.172985
H  6.628472 -1.176402 0.165222
H  4.417021 -1.247578 -1.130597
H  4.225817 -1.6229 0.602767
H  6.392137 0.269435 -1.894495
H  5.776824 1.601026 -0.897601
H  -1.50149 -2.345112 -0.505476
H  -3.654629 0.926878 1.831404
H  -2.956811 -0.756611 -2.118151
H  7.972671 1.662209 0.39264
H  8.244238 1.908392 -1.356065
H  8.595894 0.322375 -0.611345
H  -6.086282 0.325128 1.654947
H  -5.372504 -1.421472 -2.26292
H  -6.94509 -0.864787 -0.383686
H  -0.189769 4.43536 -0.358135
H  -0.159025 4.198434 1.425369
H  -1.278487 5.432346 0.70097
