program: Gaussian 09
title: 000234497
version: EM64L-G09RevD.01
frameworkgroup: C1[X(C15H14N2OS)]
method: RPBEPBE
basis: SDD
operation: Freq
keyword: #p
keyword: freq=noraman
keyword: PBEPBE/SDD
title: #p freq=noraman PBEPBE/SDD
converged: YES YES NO NO
title: Mulliken charges:
elementType: S O N N C C C C C C C C C C C C C C C H H H H H H H H H H H H H H
charge: 0.188849 -0.265011 -0.378137 -0.085528 0.458125 -0.320242 0.397095 -0.204546 -0.472919 -0.306649 0.344248 -0.330529 -0.383526 -0.279818 -0.353240 -0.247974 -0.211225 -0.244005 -0.685064 0.316812 0.218405 0.315072 0.245722 0.249143 0.242506 0.252287 0.228330 0.228316 0.206016 0.205866 0.206261 0.232681 0.232680
chargesum: 0.00000
title: Mulliken charges with hydrogens summed into heavy atoms:
elementType: S O N N C C C C C C C C C C C C C C C
charge: 0.188849 -0.265011 -0.061325 -0.085528 0.458125 -0.320242 0.397095 -0.204546 -0.254514 0.008424 0.344248 -0.084807 -0.134384 -0.037312 -0.100953 -0.019644 0.017090 0.167877 -0.013443
polarizability: 3.89598353e+02 1.75533660e+01 2.01818759e+02 3.29428148e-02 -6.90798302e-02 8.30875151e+01
1716.lowfreq: -2.6243 -0.0018 -0.0010 0.0006 3.4702 3.7731 28.2951 42.1934 60.2762
frequency: 28.2521 42.1875 60.2756 63.2196 115.9435 118.9225 133.4298 175.2411 187.1629 193.7546 242.2878 250.5538 306.2478 349.9191 360.1672 363.2214 415.8564 416.3550 430.9895 482.2223 503.5434 511.6360 539.3110 553.4346 557.0906 582.8062 617.6595 630.4398 674.5317 719.8451 727.9174 736.9831 754.7170 759.6677 795.2610 822.1133 832.4609 852.4677 857.7409 887.5088 903.0647 916.7173 937.2122 977.6092 989.2857 999.5422 1015.7537 1035.5031 1038.6360 1099.2240 1116.1019 1122.1805 1127.5380 1136.5705 1168.7794 1182.7280 1216.5840 1240.2588 1261.9900 1263.1734 1298.2325 1308.7847 1361.7994 1373.5983 1377.1832 1401.6702 1427.7995 1436.0497 1444.9770 1461.0492 1477.5608 1487.3243 1502.0038 1514.4446 1565.7237 1583.1776 1595.7980 1626.8770 1631.5205 2950.1796 2997.8608 3007.1533 3094.7641 3107.1907 3111.9540 3134.5665 3148.5854 3160.2354 3163.6490 3164.5106 3174.2575 3184.6751 3549.4357
redmass: 4.4284 4.1961 5.1996 4.5424 3.3486 2.1523 4.1364 5.6251 5.3473 7.5524 1.2088 4.5137 6.1386 4.4281 4.6674 6.5563 3.0941 4.7912 3.1644 9.4756 7.2268 2.2422 4.3725 6.7184 1.4053 5.6123 7.5530 7.1016 7.0750 3.6106 2.6605 4.8802 6.6151 1.5192 1.3731 5.7000 1.1054 1.4612 1.3883 7.1655 3.2606 1.3828 1.3829 1.3133 1.3026 2.8314 2.6855 3.6569 2.8617 3.1864 2.1310 1.5600 1.4511 1.4371 1.0928 1.2895 2.2214 2.9120 1.9338 1.1424 2.4930 1.3334 2.0378 4.3586 2.2018 1.2893 3.8536 2.8921 2.8394 1.0396 1.0880 1.2137 1.8329 1.8479 6.4761 7.5506 4.4533 7.9233 7.1626 1.0553 1.0363 1.1074 1.0988 1.1013 1.0897 1.0855 1.0904 1.0899 1.0954 1.0934 1.0997 1.0961 1.0762
irintensity: 1.5644 0.4157 0.2031 0.0853 1.0273 4.9034 0.6666 0.0155 2.8668 4.6239 0.6393 2.9665 0.0065 2.3575 7.5460 0.4584 0.1681 6.9311 8.3065 2.5715 1.5913 55.1094 0.2689 40.4235 37.4779 1.7756 4.0231 1.2116 3.7508 0.0087 16.4755 6.9912 6.9930 88.2239 49.3162 2.7731 0.3819 54.2597 8.3929 20.9607 64.2512 1.6846 3.7054 0.1243 1.7367 3.0448 26.0077 12.4869 95.8194 110.0701 6.0260 14.6470 6.4455 4.5232 0.3023 129.5209 347.0922 7.8180 1.4796 0.0308 25.5473 0.3859 7.7815 8.5830 90.2542 59.8919 1.3860 17.3379 63.7854 11.7994 66.5518 114.1415 146.2043 190.1870 149.0877 353.8454 90.9389 336.0381 175.3472 50.9603 31.4414 40.4516 31.1425 34.5545 21.3581 2.2776 10.6321 3.6837 22.2329 15.9763 19.3744 12.7450 47.5843
temp: 298.150 k
press: 1.00000 atm
elementType: 16 8 7 7 6 6 6 6 6 6 6 6 6 6 6 6 6 6 6 1 1 1 1 1 1 1 1 1 1 1 1 1 1
symmnumber: 1
zpe: 671262.9 jmol-1
zpe.correction: 0.255671 hartree
zpe.thermalcorrener: 0.272423 hartree
zpe.thermalcorrenthalpy: 0.273367 hartree
zpe.thermalcorrgfe: 0.210047 hartree
zpe.sumelectzpe: -1161.444230 hartree
zpe.sumelectthermal: -1161.427478 hartree
zpe.sumelectthermalent: -1161.426534 hartree
zpe.sumelectthermalfe: -1161.489854 hartree
dipole: -2.0022 -2.4374 0.0118
dipole: 3.1543
quadrupole: -89.8150 -106.7543 -125.9627
quadrupole: 8.9071 -0.0525 -0.0187
quadrupole: 17.6957 0.7564 -18.4520 8.9071 -0.0525 -0.0187
hfenergy: -1161.6999008 hartree
pointgroup: C01 [X(C15H14N2O1S1)]
dipole: -0.8264824 0.9257494 -0.0046115 debye
polarizability: 390.472182|-9.9584367|200.6233014|-8.6078103|-2.7953073|83.4091437 unknown
InChI: InChI=1S/C15H14N2OS/c1-2-18-12-9-7-11(8-10-12)16-15-17-13-5-3-4-6-14(13)19-15/h3-10,16H,2H2,1H3
charge 0 multiplicity 1
33 atoms
S  2.869598 2.157414 -0.074953
O  -4.913302 -1.003908 0.233169
N  0.152273 1.524646 0.017795
N  1.730715 -0.312087 0.019362
C  -1.110638 0.863958 0.072709
C  3.926668 0.676585 -0.068521
C  3.123269 -0.511956 -0.015554
C  1.409516 0.966831 -0.003744
C  -2.273882 1.673292 0.081975
C  -1.246453 -0.550751 0.11808
C  -3.690413 -0.314658 0.179681
C  -3.559562 1.096017 0.134934
C  -2.527985 -1.124547 0.171024
C  5.33042 0.622574 -0.108444
C  3.761561 -1.774129 -0.002823
C  5.95003 -0.650486 -0.095042
C  5.170292 -1.834495 -0.042718
C  -6.151163 -0.201481 0.241056
C  -7.316237 -1.186018 0.294517
H  0.112924 2.544673 -0.008673
H  -2.181896 2.766887 0.047841
H  -0.349577 -1.172957 0.110745
H  -4.435865 1.750134 0.140713
H  -2.649138 -2.21158 0.206037
H  5.935549 1.533388 -0.148998
H  3.149779 -2.680132 0.037492
H  7.042754 -0.716092 -0.125528
H  5.669028 -2.80964 -0.033149
H  -6.150874 0.470247 1.124848
H  -6.193364 0.422089 -0.676381
H  -8.276682 -0.639109 0.301906
H  -7.300326 -1.854875 -0.582704
H  -7.259416 -1.806835 1.204747
