program: Gaussian 09
title: 000234487
version: EM64L-G09RevD.01
frameworkgroup: C1[X(C14H23N5O4)]
method: RPBEPBE
basis: SDD
operation: Freq
keyword: #p
keyword: freq=noraman
keyword: PBEPBE/SDD
title: #p freq=noraman PBEPBE/SDD
converged: YES YES NO NO
title: Mulliken charges:
elementType: O O O O N N N N N C C C C C C C C C C C C C C H H H H H H H H H H H H H H H H H H H H H H H
charge: -0.235141 -0.306445 -0.307624 -0.282023 -0.226699 -0.160401 -0.367865 -0.219078 -0.138083 0.158661 0.100737 0.222072 0.152456 -0.378728 0.203128 0.022183 -0.675609 -0.618668 -0.603820 -0.206987 -0.234309 -0.681155 -0.672855 0.211098 0.272212 0.352613 0.186944 0.229729 0.308919 0.236856 0.270212 0.243330 0.241738 0.267311 0.245129 0.245321 0.180467 0.217270 0.201368 0.205483 0.204835 0.235298 0.229698 0.212158 0.228260 0.230003
chargesum: 0.00000
title: Mulliken charges with hydrogens summed into heavy atoms:
elementType: O O O O N N N N N C C C C C C C C C C C C C C
charge: -0.235141 -0.306445 -0.307624 -0.282023 -0.226699 -0.160401 -0.015252 -0.219078 -0.138083 0.158661 0.100737 0.222072 0.152456 0.104582 0.203128 0.209126 0.099896 0.136612 0.153941 0.190750 0.172542 -0.011324 -0.002434
polarizability: 2.90289814e+02 7.55715897e+00 2.00802915e+02 -1.84908306e+01 1.87560422e+01 1.50760712e+02
1716.lowfreq: -6.5866 -0.0006 -0.0004 0.0005 4.3694 4.9324 11.6405 21.0068 35.5725
frequency: 11.4797 20.3920 35.3803 37.8044 55.1953 62.6495 84.0502 86.8552 100.9036 102.8457 109.1707 119.8166 127.9507 129.2485 146.1770 174.7234 190.5594 216.6585 222.0481 228.0701 239.8391 245.5101 251.4625 290.2713 306.4923 317.3173 321.7421 328.8570 351.6637 363.2706 388.8904 414.7388 439.5246 451.6440 495.8927 506.7036 546.1840 567.8858 620.6621 640.5178 650.9667 695.2202 700.2882 726.8790 727.4408 762.7662 788.4261 811.8163 819.4071 824.4238 887.1630 911.0897 922.5340 957.3592 972.3684 1016.7150 1029.2611 1040.2463 1045.0037 1052.3210 1075.9788 1113.5980 1115.3862 1127.7309 1130.0975 1130.9999 1132.3851 1132.8065 1139.1862 1185.8196 1205.3838 1212.6842 1229.2108 1230.8765 1251.7796 1253.7945 1266.0961 1300.6252 1313.1057 1316.0639 1327.9808 1360.9463 1375.5499 1378.4371 1391.6993 1398.3275 1399.9955 1410.7102 1427.2156 1450.3806 1457.1049 1460.4725 1460.7158 1472.4268 1474.3847 1474.6321 1477.1017 1478.7093 1479.5180 1480.3958 1489.6447 1490.5862 1494.1857 1495.4458 1504.9229 1558.4028 1601.7543 1642.3236 1654.0925 2911.9618 2927.6967 2949.3136 2970.0156 2971.7417 2995.0415 2996.4963 3001.2885 3004.0460 3007.9029 3009.1789 3053.1186 3088.5324 3091.5580 3092.9485 3094.0491 3098.2144 3101.0464 3101.6606 3105.0707 3133.7490 3136.0375 3549.5584
redmass: 4.6134 4.0057 2.8356 3.0058 2.5896 4.3453 3.3826 2.3859 2.6768 1.0888 3.5982 1.2248 3.0758 3.1452 4.4859 1.1100 3.2772 3.2413 3.2913 4.5429 1.3623 1.2705 3.7379 2.8515 3.6496 3.9677 4.2974 3.0106 3.9474 8.2573 9.1252 7.7960 3.5717 5.1417 4.8261 1.9508 2.5088 3.5996 4.9826 8.9703 4.6542 11.2468 11.3647 7.9598 8.1539 4.8440 2.7597 1.1011 1.5898 1.9812 3.6876 3.1422 2.6838 5.4924 2.8534 3.0797 2.5275 3.0005 2.9993 2.9397 3.0783 2.3278 2.2281 1.2983 1.3008 1.6844 1.6652 1.3119 1.5525 3.1551 3.2364 2.6119 1.8555 1.9599 1.1597 1.1570 4.8264 6.1925 1.6015 1.1742 1.6506 2.1423 1.4089 1.3375 2.0735 1.3064 1.2897 1.2960 1.2462 1.3928 2.0964 1.0405 1.0406 1.2943 1.0468 1.0757 1.0544 1.0584 1.0583 1.0487 1.1041 1.1816 1.0491 1.1007 2.2754 6.8373 8.6499 9.5363 9.7706 1.0824 1.0626 1.0562 1.0371 1.0680 1.0360 1.0366 1.1068 1.0336 1.0328 1.0988 1.1024 1.0926 1.1022 1.0990 1.0990 1.1020 1.1005 1.1013 1.1012 1.1021 1.1010 1.0766
irintensity: 0.0311 0.2547 0.4587 0.1921 2.0623 0.2109 1.0053 0.6467 3.6200 0.5446 0.6533 3.6216 9.9974 6.6529 1.1953 0.4157 0.5474 10.5200 3.2922 3.8614 0.7811 0.1971 0.6990 3.8057 6.7969 4.6946 3.3594 3.8307 14.6796 0.6218 19.7617 1.8698 5.7786 10.0107 21.3534 33.0612 56.7443 17.2479 6.7773 0.7277 7.0140 0.7711 3.5858 16.0269 22.2187 1.2436 40.7647 4.1856 12.4450 7.7752 27.6318 117.5686 28.0952 54.4206 6.8627 170.8465 37.0393 162.0460 28.3217 16.4468 105.9954 18.2547 3.1338 0.2856 0.2866 7.1272 13.7164 1.6108 12.7983 17.1704 13.3010 212.1531 29.6632 7.5447 2.5502 0.9077 41.3810 19.6091 47.4905 34.8482 66.2532 27.3050 3.8618 13.4952 20.6145 19.6346 16.6837 2.9185 36.7379 19.0502 304.1550 10.2090 13.8336 71.3168 17.4165 31.3724 13.6260 8.5288 10.4283 3.6370 26.4790 42.6462 20.3684 23.4464 88.0211 224.1309 820.6989 651.4344 313.0386 29.2304 61.7935 87.6618 58.1506 121.8772 22.0982 24.8738 38.9069 39.6465 37.9349 36.2103 26.1610 5.6614 20.4316 30.4882 37.7753 20.9244 2.3214 37.2907 32.5157 0.8033 0.7007 172.0216
temp: 298.150 k
press: 1.00000 atm
elementType: 8 8 8 8 7 7 7 7 7 6 6 6 6 6 6 6 6 6 6 6 6 6 6 1 1 1 1 1 1 1 1 1 1 1 1 1 1 1 1 1 1 1 1 1 1 1
symmnumber: 1
zpe: 984016.1 jmol-1
zpe.correction: 0.374792 hartree
zpe.thermalcorrener: 0.400323 hartree
zpe.thermalcorrenthalpy: 0.401267 hartree
zpe.thermalcorrgfe: 0.316420 hartree
zpe.sumelectzpe: -1120.189946 hartree
zpe.sumelectthermal: -1120.164414 hartree
zpe.sumelectthermalent: -1120.163470 hartree
zpe.sumelectthermalfe: -1120.248318 hartree
dipole: 10.6302 0.2417 -1.4317
dipole: 10.7289
quadrupole: -128.9949 -138.2701 -133.7610
quadrupole: -0.6136 -2.0825 -2.8456
quadrupole: 4.6804 -4.5948 -0.0857 -0.6136 -2.0825 -2.8456
hfenergy: -1120.5647377 hartree
pointgroup: C01 [X(C14H23N5O4)]
dipole: -4.0924182 -0.661396 0.7950052 debye
polarizability: 283.7487931|21.801507|177.55355|-28.5810828|28.2727133|180.5510983 unknown
InChI: InChI=1S/C14H23N5O4/c1-6-22-9(23-7-2)8-15-13-16-11-10(17(13)3)12(20)19(5)14(21)18(11)4/h9,15H,6-8H2,1-5H3
charge 0 multiplicity 1
46 atoms
O  -3.636327 -0.154375 -1.09924
O  -3.998726 -0.35334 1.271049
O  3.373521 2.270262 1.377991
O  5.210461 -0.675792 -1.825304
N  0.72358 0.634946 1.021088
N  2.962763 -0.999055 -1.226139
N  -1.363391 -0.573065 0.822372
N  4.270948 0.768479 -0.234608
N  0.628675 -1.146367 -0.434981
C  2.002905 0.512556 0.423115
C  1.891312 -0.578498 -0.452902
C  -0.057899 -0.377527 0.472099
C  3.199951 1.27084 0.60149
C  -2.20109 -1.590841 0.189045
C  4.206254 -0.3245 -1.137086
C  -3.63181 -1.056949 0.022172
C  0.308578 1.642772 2.003339
C  2.817759 -2.143166 -2.144296
C  5.57966 1.454318 -0.1577
C  -4.964265 0.416361 -1.412479
C  -5.270485 -0.7810 1.893513
C  -4.820227 1.216693 -2.705039
C  -5.496509 0.101331 3.119669
H  -2.239423 -2.513425 0.803855
H  -1.771852 -1.8496 -0.792351
H  -1.83439 0.039545 1.490829
H  -4.354842 -1.891126 -0.141746
H  -0.010039 1.165405 2.949301
H  1.175502 2.2915 2.205897
H  -0.51977 2.260351 1.608213
H  3.775771 -2.269926 -2.669275
H  2.00702 -1.946694 -2.865851
H  2.569841 -3.056803 -1.577639
H  5.479499 2.259882 0.584672
H  5.851861 1.867679 -1.143047
H  6.364241 0.741389 0.144917
H  -5.700101 -0.411419 -1.529957
H  -5.289131 1.062442 -0.572837
H  -6.101224 -0.668134 1.165799
H  -5.204297 -1.850719 2.183468
H  -5.785299 1.680022 -2.979788
H  -4.070933 2.016723 -2.578897
H  -4.493276 0.565746 -3.533657
H  -6.439336 -0.178127 3.623938
H  -4.669556 -0.014437 3.841463
H  -5.556905 1.164143 2.828624
