program: Gaussian 09
title: 000234481
version: EM64L-G09RevD.01
frameworkgroup: C1[X(C10H12N4O2S)]
method: RPBEPBE
basis: SDD
operation: Freq
keyword: #p
keyword: freq=noraman
keyword: PBEPBE/SDD
title: #p freq=noraman PBEPBE/SDD
converged: YES YES NO NO
title: Mulliken charges:
elementType: S O O N N N N C C C C C C C C C C H H H H H H H H H H H H
charge: 0.277976 -0.258161 -0.223555 -0.159961 -0.053843 -0.031533 0.001293 0.140842 -0.502115 0.124347 -0.185042 -0.358577 0.273045 -0.377823 -0.260384 -0.659980 -0.823921 0.269949 0.303792 0.277308 0.247558 0.230791 0.240164 0.224951 0.247478 0.229668 0.281229 0.282409 0.242093
chargesum: 0.00000
title: Mulliken charges with hydrogens summed into heavy atoms:
elementType: S O O N N N N C C C C C C C C C C
charge: 0.277976 -0.258161 -0.223555 -0.159961 -0.053843 -0.031533 0.001293 0.140842 0.071625 0.124347 0.092266 -0.358577 0.273045 -0.130264 0.210571 0.042117 -0.018190
polarizability: 2.48979110e+02 2.42626657e+00 1.52535344e+02 -1.93282267e+01 9.19190091e-01 9.19352298e+01
1716.lowfreq: -0.0008 0.0007 0.0019 2.4751 3.4386 7.5204 16.7840 21.6640 42.9322
frequency: 16.6827 21.5936 42.9114 64.6402 76.9241 94.7712 101.5928 122.4209 143.6765 192.4456 210.9810 223.0848 235.8510 253.9600 279.4169 318.3261 330.4855 401.2866 418.0726 528.0604 541.3544 554.3899 576.0534 622.7181 635.3746 652.5513 659.1901 677.3808 740.6659 791.4064 797.5831 813.4508 827.7976 838.4019 889.9775 911.2864 919.7551 962.2357 978.2579 991.1416 1012.8062 1095.0405 1102.5648 1111.3218 1144.8618 1158.6682 1178.8175 1214.8344 1242.9270 1278.3668 1290.9220 1305.6778 1318.7268 1344.5319 1351.5962 1363.4884 1372.6786 1391.5320 1393.2338 1433.6516 1441.0667 1448.4588 1460.3176 1462.3258 1464.8879 1484.1217 1522.4635 1546.2351 1657.5913 2994.8971 3009.4547 3026.4587 3035.6073 3074.5329 3090.2357 3097.1738 3124.5784 3151.4790 3158.7418 3172.0000 3244.1676
redmass: 4.5896 4.7353 5.6861 3.9329 3.5020 4.1372 1.2181 3.4469 4.0338 2.3187 3.4538 2.8379 2.7118 3.2279 3.5279 4.3718 6.0449 8.8736 3.5892 3.6951 4.6232 5.0088 7.2160 7.3733 5.0754 7.2896 7.1662 4.9453 5.3800 5.6414 1.4816 5.1944 2.3951 2.2253 3.9501 5.8355 1.4328 2.3072 1.1799 1.2963 2.8017 2.2101 4.4891 3.3741 5.8150 1.6853 3.7827 1.7998 1.7807 1.1193 5.8254 4.5288 2.8636 1.1389 1.3619 1.4856 5.1221 1.2313 1.7121 1.0524 1.4396 1.0557 1.1618 2.0882 1.0481 1.0533 9.5959 9.3882 9.2139 1.0360 1.0615 1.0282 1.0600 1.1000 1.0973 1.1027 1.1069 1.1042 1.1055 1.0923 1.0990
irintensity: 0.2706 0.4223 1.9265 0.9053 2.8086 1.3409 0.4898 1.5158 4.8269 3.6479 2.7124 9.3555 0.5693 1.1357 5.4714 9.1986 10.7204 4.5972 2.1315 4.7381 3.2717 6.2020 10.7386 0.7650 12.9713 3.3649 4.4861 15.8105 27.5072 4.9084 0.7955 38.0533 7.3346 13.0494 34.8147 50.1655 11.9848 11.5865 6.9453 5.9280 62.9769 49.3955 5.9172 44.9230 510.7789 34.8901 7.3947 28.6452 50.6439 5.7496 62.6164 58.5148 10.6712 1.6893 17.6990 23.6222 13.0357 24.3180 40.1249 14.1426 34.9848 23.1597 26.4750 63.4104 14.9922 13.3662 218.3296 98.1364 145.5923 17.0951 34.3548 23.1039 24.6343 3.4907 31.8003 2.3519 28.7056 8.0621 9.9068 14.9039 0.2648
temp: 298.150 k
press: 1.00000 atm
elementType: 16 8 8 7 7 7 7 6 6 6 6 6 6 6 6 6 6 1 1 1 1 1 1 1 1 1 1 1 1
symmnumber: 1
zpe: 569609.1 jmol-1
zpe.correction: 0.216953 hartree
zpe.thermalcorrener: 0.233833 hartree
zpe.thermalcorrenthalpy: 0.234777 hartree
zpe.thermalcorrgfe: 0.169118 hartree
zpe.sumelectzpe: -1154.523501 hartree
zpe.sumelectthermal: -1154.506620 hartree
zpe.sumelectthermalent: -1154.505676 hartree
zpe.sumelectthermalfe: -1154.571335 hartree
dipole: 4.1983 1.6957 -0.9851
dipole: 4.6337
quadrupole: -74.4249 -114.1911 -105.7243
quadrupole: -4.4958 -3.0138 3.4430
quadrupole: 23.6885 -16.0777 -7.6109 -4.4958 -3.0138 3.4430
hfenergy: -1154.7404531 hartree
pointgroup: C01 [X(C10H12N4O2S1)]
dipole: -1.5979612 -0.7105417 -0.5149364 debye
polarizability: 245.9367167|5.0193086|152.7318088|28.3200564|3.2061564|94.7811585 unknown
InChI: InChI=1S/C10H12N4O2S/c1-3-16-7(15)4-14-6-13-8-9(14)11-5-12-10(8)17-2/h5-6H,3-4H2,1-2H3
charge 0 multiplicity 1
29 atoms
S  4.210295 1.329262 0.793225
O  -4.020265 -0.858898 -0.138142
O  -2.885199 0.816972 1.034555
N  -0.549029 0.271773 -0.534348
N  1.024037 1.890318 -0.096115
N  0.82338 -1.749454 -0.136143
N  3.121602 -1.189501 0.505772
C  0.626553 -0.406121 -0.196709
C  -1.813171 -0.376207 -0.865475
C  1.593476 0.613595 0.067296
C  -0.249552 1.642717 -0.447233
C  2.886866 0.153129 0.431101
C  -2.929237 -0.046907 0.134382
C  2.101865 -2.062178 0.225029
C  -5.243807 -0.653037 0.708667
C  -6.114403 0.468236 0.137974
C  5.60896 0.133442 1.189954
H  -2.155972 -0.088327 -1.876649
H  -1.639109 -1.466558 -0.874731
H  -0.999309 2.407731 -0.633404
H  2.344457 -3.125656 0.300396
H  -5.744973 -1.632625 0.669743
H  -4.917024 -0.430094 1.7392
H  -7.049559 0.542137 0.723172
H  -5.59717 1.44046 0.197786
H  -6.382648 0.265247 -0.913036
H  5.815257 -0.50031 0.316754
H  5.32853 -0.495149 2.046022
H  6.47365 0.770802 1.431462
