program: Gaussian 09
title: 000234475
version: EM64L-G09RevD.01
frameworkgroup: C1[X(C13H10N2S)]
method: RPBEPBE
basis: SDD
operation: Freq
keyword: #p
keyword: freq=noraman
keyword: PBEPBE/SDD
title: #p freq=noraman PBEPBE/SDD
converged: NO YES NO NO
title: Mulliken charges:
elementType: S N N C C C C C C C C C C C C C H H H H H H H H H H
charge: 0.203390 -0.040233 -0.685225 0.545887 -0.372595 -0.336368 0.324714 -0.385529 -0.352401 -0.280100 -0.354061 0.501848 -0.409416 -0.422558 -0.242709 -0.215242 0.272106 0.231063 0.243164 0.255691 0.220985 0.220149 0.227414 0.228273 0.311174 0.310579
chargesum: 0.00000
title: Mulliken charges with hydrogens summed into heavy atoms:
elementType: S N N C C C C C C C C C C C C C
charge: 0.203390 -0.040233 -0.063473 0.545887 -0.372595 -0.336368 0.324714 -0.113424 -0.121337 -0.036936 -0.098371 0.501848 -0.188431 -0.202409 -0.015295 0.013032
polarizability: 3.79640560e+02 -5.07569792e+00 1.66227819e+02 -1.86748504e-02 -3.17533024e-02 6.38314255e+01
1716.lowfreq: -4.6134 -2.7423 -0.0006 0.0016 0.0026 4.3897 41.9752 50.8189 88.0178
frequency: 41.9386 50.8009 88.0165 123.8653 187.3241 242.0605 249.7869 272.5837 346.0024 368.5484 396.8960 401.3130 404.6957 406.6666 436.5219 485.6615 502.4710 528.7314 551.7861 607.7485 611.3154 624.2499 651.2569 680.5291 731.9151 738.6678 764.0835 811.0208 813.1159 837.6676 843.4106 861.1603 900.0690 942.4765 947.0692 980.3017 981.0434 998.8299 1015.4330 1019.1716 1042.0420 1116.2512 1134.2151 1167.7871 1187.0226 1201.5142 1254.7554 1293.2840 1315.6781 1327.2032 1374.4913 1381.3899 1432.3763 1443.1953 1449.9844 1495.1987 1541.2915 1564.8715 1570.8439 1606.7265 1632.4624 1645.4504 3120.2247 3123.7600 3133.5099 3143.2505 3147.8955 3162.8366 3165.2888 3173.4659 3560.2751 3700.0699
redmass: 4.2165 5.3826 5.5009 5.2664 5.7796 7.4949 5.1696 5.2910 4.7849 4.3236 1.0298 1.2884 4.6139 2.8081 3.1615 8.9959 3.1707 7.7549 3.3161 7.8500 5.3802 7.0913 7.6068 7.1643 2.5354 3.5341 1.5919 5.2311 1.3111 1.7111 6.6118 1.3950 8.0606 1.3842 1.3935 1.3553 1.3150 2.7512 2.2247 1.4626 4.7637 1.5651 1.2410 1.1544 1.3624 1.9914 1.7377 2.3321 1.3860 3.0656 4.3253 4.4129 3.0311 2.6743 4.2719 4.2278 5.4721 6.2486 6.5385 7.2203 3.1642 1.4429 1.0869 1.0895 1.0854 1.0966 1.0903 1.0955 1.0952 1.0997 1.0450 1.1040
irintensity: 0.0550 4.1127 1.8140 0.1598 0.8269 0.8801 3.0450 1.4327 13.2584 2.1514 4.5690 297.7853 6.0588 2.0045 14.5826 1.9476 7.7860 13.2548 6.3067 36.5562 2.9567 0.1711 17.4859 1.2085 22.1337 2.5031 78.2123 3.5742 9.3807 78.3955 1.8758 1.7192 52.4801 3.0252 0.0591 0.5376 0.1055 1.5163 12.6043 0.3722 7.5339 14.9459 18.6525 0.8653 145.8686 4.2981 9.2294 14.2018 1.4432 112.2213 6.1685 10.4127 25.8328 15.6082 10.9827 378.7127 41.6141 2.5629 6.9802 6.8906 159.4822 475.9970 15.1429 29.8340 2.5661 16.3162 10.4792 20.8369 6.1586 26.2027 162.5477 23.2052
temp: 298.150 k
press: 1.00000 atm
elementType: 16 7 7 6 6 6 6 6 6 6 6 6 6 6 6 6 1 1 1 1 1 1 1 1 1 1
symmnumber: 1
zpe: 514722.1 jmol-1
zpe.correction: 0.196047 hartree
zpe.thermalcorrener: 0.209006 hartree
zpe.thermalcorrenthalpy: 0.209951 hartree
zpe.thermalcorrgfe: 0.156053 hartree
zpe.sumelectzpe: -1007.876316 hartree
zpe.sumelectthermal: -1007.863357 hartree
zpe.sumelectthermalent: -1007.862413 hartree
zpe.sumelectthermalfe: -1007.916310 hartree
dipole: 4.0271 -0.3567 0.0181
dipole: 4.0429
quadrupole: -55.0620 -91.0972 -108.2988
quadrupole: 1.1921 0.1294 -0.0456
quadrupole: 29.7573 -6.2778 -23.4795 1.1921 0.1294 -0.0456
hfenergy: -1008.0723635 hartree
pointgroup: C01 [X(C13H10N2S1)]
dipole: -1.5865342 -0.1125402 -0.0156224 debye
dipolederiv: -0.4139938 0.0746024 0.002183 0.3063419 -0.4734199 -0.0209557 0.0121162 -0.0220469 0.0410279 -1.0196861 -0.219952 -0.0108559 -0.4184569 -0.6984298 -0.0218281 -0.019642 -0.0217928 -0.194663 -2.220498 0.1120844 0.0050257 0.1427921 -0.1012699 0.0312449 0.0165994 0.0307052 -0.7274473 -0.9834583 0.0320168 -0.0002953 0.2031213 -0.3052226 -0.0133258 0.0065857 -0.0140058 -0.0125286 1.7157033 -0.1887714 -0.0046102 -0.2432355 0.9274149 0.0383728 -0.005932 0.0399452 -0.0201976 0.1399039 0.2161213 0.0095355 0.382134 -0.0143787 0.0037438 0.0170831 0.003602 -0.0809902 0.5237542 0.1088275 0.0056217 -0.2083365 0.0043339 -0.0033492 -0.0093942 -0.0028493 0.0736441 0.4800601 -0.1206413 -0.0047821 -0.3441205 0.145271 0.0112655 -0.013642 0.0113708 -0.0934335 0.6350527 0.1060521 0.0065763 0.2145364 0.0873104 0.0109884 0.0102702 0.0103725 -0.1147009 0.0446799 -0.1024617 -0.0040269 -0.1686626 0.0763417 0.0082777 -0.0062511 0.0083565 -0.1276119 0.0434334 -0.0403737 -0.0013522 0.0004811 0.0852701 0.0102502 0.0005191 0.0102455 -0.1593724 2.1901366 -0.1165075 -0.0024221 -0.1925789 0.0494057 -0.0055256 -0.0068118 -0.0052613 0.1525392 -0.7324733 0.0562546 0.0015162 -0.5880605 0.0859069 0.014322 -0.0315426 0.0160631 -0.2267632 -0.7162138 0.0016806 -0.0009287 0.765802 0.0216317 0.0141634 0.0364995 0.0122992 -0.22704 -0.1513518 -0.0346926 -0.0013675 -0.1426431 0.0482762 0.0090871 -0.0058598 0.0092496 -0.1749287 -0.0849341 0.1044789 0.0045899 0.2636718 -0.0025274 0.007538 0.0113289 0.0071791 -0.1693636 0.1056529 -0.0880948 -0.0045526 -0.0574106 0.0184967 -0.0066876 -0.003165 -0.0064672 0.1465237 0.0827224 0.1019068 0.0048188 0.0935981 -0.0229146 -0.0083598 0.0046964 -0.0080399 0.1451004 0.0779431 -0.0001179 -0.0001908 0.0709324 -0.0655082 -0.0095986 0.0028758 -0.0098087 0.1653828 0.0872769 0.0521855 0.0020426 0.0008521 -0.0556067 -0.0093882 -0.0001772 -0.0093616 0.1681583 -0.0383615 0.1055828 0.0047986 0.1120059 -0.0703072 -0.0115158 0.0049285 -0.0117002 0.1662612 -0.0558054 -0.1016812 -0.0056615 -0.1118448 -0.046532 -0.0111236 -0.0058725 -0.0110247 0.1686221 -0.1370199 0.0636997 0.0020175 0.0629197 0.0650756 -0.0040839 0.0017887 -0.0040438 0.1657016 -0.0773704 -0.1077438 -0.0050135 -0.1265598 0.0002876 -0.0070792 -0.0057746 -0.00702 0.1626263 0.2449855 -0.0206388 -0.0019638 -0.1046799 0.12588 -0.012499 -0.0103749 -0.0114194 0.3871345 0.2598613 0.0061833 -0.0007029 0.0874005 0.1152147 -0.0139337 -0.0008518 -0.014547 0.3863188 unknown
polarizability: 379.7504373|1.3817668|165.9089075|0.7334697|4.6036133|64.0404595 unknown
InChI: InChI=1S/C13H10N2S/c14-10-7-5-9(6-8-10)13-15-11-3-1-2-4-12(11)16-13/h1-8H,14H2
charge 0 multiplicity 1
26 atoms
S  0.924241 -1.789857 -0.081755
N  0.836263 0.91132 0.032312
N  -5.678533 0.179088 -0.011293
C  -1.430538 -0.086732 -0.014815
C  0.027285 -0.133657 -0.013765
C  2.4685 -0.848525 -0.038296
C  2.19473 0.560325 0.020276
C  -2.087049 1.178674 0.046263
C  -2.237584 -1.257022 -0.075022
C  3.786688 -1.341803 -0.056305
C  3.272084 1.478626 0.061047
C  -4.28983 0.091586 -0.013198
C  -3.484343 1.270083 0.047396
C  -3.638009 -1.176693 -0.074612
C  4.849229 -0.409234 -0.01493
C  4.592189 0.987232 0.043189
H  -1.468969 2.080728 0.092545
H  -1.763627 -2.24478 -0.123663
H  3.992283 -2.415619 -0.101202
H  3.056584 2.550219 0.105567
H  -3.967707 2.253443 0.095559
H  -4.238276 -2.093177 -0.121728
H  5.882668 -0.7721 -0.027899
H  5.432235 1.689474 0.074338
H  -6.14403 1.081515 0.027077
H  -6.254888 -0.656413 -0.059483
